{"text_format":"1","workbook":"xlsx","n_sheets":6,"sheets":["Anleitung","Konfiguration","Ausgaben","Einnahmen","Antrag","Abrechnung"],"not_rendered":{"charts":0,"images":1,"macros":1,"external_links":0,"defined_names":1,"comments":0,"pivot_tables":0},"unopened":[],"bounds":{"document_bytes":16777216,"sheet_cells":100000,"rows_first":2000,"rows_last":500,"rows_between":2000,"halvings":0,"cell_chars":16384,"cell_head_chars":4096},"cells_cut":0,"cells_raw":0,"read":"whole","date_system":"1900"}

{"sheet":"Anleitung","index":0,"n_rows":52,"n_cols":12,"rows_kept":52,"cut":false,"hidden":false,"merged":[[1,1,1,5],[3,1,3,3]]}
[]
[null,"Vorlage StuPa Antrag und Abrechnung"]
[]
[null,"Schritt-für-Schritt Anleitung"]
[null,"1. Aktiviere die Makros (siehe auch FAQ)"]
[null,"2. Trage im Tabellenblatt \"Konfiguration\" in Spalte G alle notwendigen Informationen ein. Du kannst auch ein eigenes Logo über den Button auswählen und verwenden."]
[null,"     Wenn du eine Zelle auswählst, erscheint ein kleiner Hilfstext, wie du die Zelle ausfüllen musst."]
[null,"3. Liste deine Finanzkalkulation detailliert auf. Erstelle dafür im Tabellenblatt \"Konfiguration\" in Spalte B Posten."]
[null,"     Die Posten dienen dazu, die Einnahmen und Ausgaben sinnvoll zu gruppieren und zusammenzufassen."]
[null,"     In Spalte C trägst du die kalkulierten Ausgaben für die entsprechenden Posten ein. In Spalte D die kalkulierten Einnahmen."]
[null,"4. Gehe auf das Tabellenblatt \"Antrag\" und prüfe die Daten."]
[null,"     Wenn alles stimmt, drücke im Tabellenblatt \"Konfiguration\" auf den Button \"Antrag generieren\". Der Antrag wird nun als PDF gespeichert."]
[null,"     Bitte schicke diese PDF an praesidium@stupa.uni-luebeck.de"]
[null,"5. Nach erfolgreicher Abstimmung kannst du anfangen, Geld auszugeben und einzunehmen"]
[null,"     Trage in den Tabellenblättern \"Ausgaben\" und \"Einnahmen\" jede Ausgabe bzw. Einnahme ein und weise sie einem Posten zu (siehe Schritt 2)"]
[null,"6. Wenn alle Geldbewegungen abgeschlossen sind, kannst du die Abrechnung vorbereiten."]
[null,"     Gehe dazu auf das Tabellenblatt \"Abrechnung\" und prüfe die Daten."]
[null,"     Wenn alles stimmt, drücke im Tabellenblatt \"Konfiguration\" auf den Button \"Abrechnung generieren\". Die Abrechnung wird nun als PDF gespeichert."]
[null,"     Bitte schicke die eben generierte PDF an praesidium@stupa.uni-luebeck.de"]
[null,"     Schicke außerdem diese Excel-Datei an finanzen@asta.uni-luebeck.de"]
[]
[null,"FAQ"]
[null,"Warum funktionieren die Buttons im Tabellenblatt \"Konfiguration\" nicht? Warum muss ich Makros aktivieren?"]
[null,null,"Die beiden Buttons im Tabellenblatt \"Konfiguration\" nutzen VBA-Makros, um automatisch die Tabellenblätter Antrag beziehungsweise Abrechnung als PDF zu speichern."]
[null,null,"Standardmäßig sind Makros dekativiert. Zum Aktivieren schließe diese Datei und klicke auf sie mit einem Rechtsklick im Explorer."]
[null,null,"Wähle \"Einstellungen\" und setze unten unter \"Sicherheit\" den Haken bei \"Zulassen\"."]
[null,null,"Öffne nun wieder die Datei. Klicke oben in der gelben Warneleiste auf \"Makros aktivieren\"."]
[null,null,"Sollten die Makros immernoch nicht aktiviert sein, findest du Anleitungen für die weiterführenden Einstellungen unter",null,null,null,null,null,null,null,null,"https://www.educba.com/enable-macros-in-excel/"]
[null,null,"Wenn du die Makros nicht aktivieren möchtest, musst du in Schritt 4 bzw. 6 den Antrag (erste beiden Seiten Hochformat) bzw. die Abrechnung (erste Seite Hochformat) selbst als PDF drucken."]
[]
[null,"Warum sind im Dropdown für Posten in den Tabellen \"Ausgaben\" und \"Einnahmen\" leere Zeilen? Warum werden nicht alle Posten im Dropdown angezeigt?"]
[null,null,"Es werden die Posten aus der Spalte B der Tabelle \"Konfiguration\" angezeigt."]
[null,null,"Sorge dafür, dass alle Posten unter dem Text \"Posten\" direkt hintereinander (ohne leere Zellen) stehen"]
[]
[null,"Warum sind Zellen in der Übersicht rot?"]
[null,null,"Überschreiten die Ausgaben in einem Posten die beantragten Kosten, so werden die Ausgaben rot eingefärbt, damit du das schnell erkennst."]
[null,null,"Dieser Fall ist nicht schlimm, es muss lediglich die Summe aller Ausgaben höchstens so hoch sein wie die Antragshöhe."]
[null,null,"Zusätzlich wird die Summe der Ausgaben oben rot, wenn die Summe der Ausgaben die Antragshöhe überschreitet."]
[null,null," Sobald das passiert, solltest du zeitnah mit der haushaltsverantwortlichen Person reden."]
[]
[null,"Warum werden Zellen nicht rot, obwohl sie rot werden sollten? Warum bleiben Zellen rot, obwohl sie nicht mehr rot sein sollten?"]
[null,null,"Starte Excel neu."]
[]
[null,"Was bedeuten die unterschiedlichen Rechnungsstatus?"]
[null,null,"Eine Bewegung (Einnahme oder Ausgabe) kann drei Status besitzen: ausstehend, vorhanden, abgegeben."]
[null,null,"Ausstehend bedeutet, dass noch keine Rechnung vorliegt. In diesem Fall solltest du dich darum kümmern, eine Rechnung zu bekommen."]
[null,null,"Vorhanden bedeutet, dass du zwar eine Rechnung hast, diese Rechnung aber noch nicht der haushaltsverantwortlichen Person weitergeleitet hast."]
[null,null,"Abgegeben bedeutet, dass du die Rechnung der haushaltsverantwortlichen Person weitergeleitet hast. Bei dieser Rechnung musst du dich nun um nichts mehr kümmern."]
[null,null,"Am Ende sollten alle Bewegungen den Rechnungsstatus \"abgegeben\" haben."]
[]
[null,"Wie wurde diese Datei getestet?"]
[null,null,"Diese Excel-Datei wurde mit Excel unter Windows 10 erstellt und getestet. Die Mailentwürfe wurden mit Thunderbird getestet."]

{"sheet":"Konfiguration","index":1,"n_rows":18,"n_cols":7,"rows_kept":18,"cut":false,"hidden":false,"merged":[]}
["Konfiguration"]
[null,"Posten","Ausgaben","Einnahmen"]
["Posten mit geplanter Höhe:","Snacks",20,0,null,"Antragsart:","Veranstaltungsübernahme"]
[null,"Getränke",50,0]
[null,"Spiele",100,0,null,"Antrags-/Veranstaltungsname:","Spieleabend (Test)"]
[null,"Ticketverkauf",0,20,null,"Veranstaltungsort:","AM S4"]
[null,null,null,null,null,"Veranstaltungsdatum und -zeit:","2022-12-24"]
[]
[null,null,null,null,null,"Antragssteller*in:","Florian Marwitz"]
[null,null,null,null,null,"Organisation:","AStA"]
[null,null,null,null,null,"E-Mail:","marwitz@asta.uni-luebeck.de"]
[null,null,null,null,null,"Telefonnummer:","+49 0000 0000000"]
[]
[null,null,null,null,null,"Finanzverantwortliche*r:","Florian Marwitz"]
[null,null,null,null,null,"E-Mail:","marwitz@asta.uni-luebeck.de"]
[null,null,null,null,null,"Telefonnummer:","+49 0000 0000000"]
[]
[null,null,null,null,null,"Antragsbegründung:","Lorem ipsum dolor sit amet, consetetur sadipscing elitr, sed diam nonumy eirmod tempor invidunt ut labore et dolore magna aliquyam erat, sed diam voluptua. At vero eos et accusam et justo duo dolores et ea rebum. Stet clita kasd gubergren, no sea takimata sanctus est Lorem ipsum dolor sit amet. Lorem ipsum dolor sit amet, consetetur sadipscing elitr, sed diam nonumy eirmod tempor invidunt ut labore et dolore magna aliquyam erat, sed diam voluptua. At vero eos et accusam et justo duo dolores et ea rebum. Stet clita kasd gubergren, no sea takimata sanctus est Lorem ipsum dolor sit amet. Lorem ipsum dolor sit amet, consetetur sadipscing elitr, sed diam nonumy eirmod tempor invidunt ut labore et dolore magna aliquyam erat, sed diam voluptua. At vero eos et accusam et justo duo dolores et ea rebum. Stet clita kasd gubergren, no sea takimata sanctus est Lorem ipsum dolor sit amet. \nDuis autem vel eum iriure dolor in hendrerit in vulputate velit esse molestie consequat, vel illum dolore eu fa"]

{"sheet":"Ausgaben","index":2,"n_rows":6,"n_cols":7,"rows_kept":6,"cut":false,"hidden":false,"merged":[]}
["Ausgaben"]
[]
["Betrag","Posten","Ansprechpartner*in","Rechnungsstatus","Beschreibung","Leistungsdatum","Datum Übergabe Finanzreferat"]
[13.75,"Snacks","Florian Marwitz","abgegeben","Rewe Einkauf","2022-12-20","2022-12-20"]
[60,"Getränke","Florian Marwitz","ausstehend","Getränke über Dominik Philipp","2022-12-15"]
[10,"Spiele","Florian Marwitz","vorhanden","Skat-Blatt","2022-12-14"]

{"sheet":"Einnahmen","index":3,"n_rows":4,"n_cols":7,"rows_kept":4,"cut":false,"hidden":false,"merged":[]}
["Einnahmen"]
[]
["Betrag","Posten","Ansprechpartner*in","Rechnungsstatus","Beschreibung","Leistungsdatum","Datum Übergabe Finanzreferat"]
[13,"Ticketverkauf","Florian Marwitz","ausstehend",null,"2022-12-10"]

{"sheet":"Antrag","index":4,"n_rows":374,"n_cols":4,"rows_kept":374,"cut":false,"hidden":false,"merged":[[21,1,21,3],[4,1,4,2],[1,1,2,2],[3,1,3,2]]}
[]
[null,"ANTRAG"]
[]
[null,{"$f":"Konfiguration!G5","v":"Spieleabend (Test)"}]
[null,{"$f":"IF(Konfiguration!G3=\"Veranstaltungsübernahme\", \"Antrag auf Veranstaltungsübernahme\", \"Antrag auf Kostenübernahme\")","v":"Antrag auf Veranstaltungsübernahme"}]
[]
[null,{"$f":"Konfiguration!F9","v":"Antragssteller*in:"},{"$f":"Konfiguration!G9","v":"Florian Marwitz"}]
[null,{"$f":"IF(Konfiguration!G10<>\"\",Konfiguration!F10,\"\")","v":"Organisation:"},{"$f":"IF(Konfiguration!G10<>\"\",Konfiguration!G10,\"\")","v":"AStA"}]
[null,{"$f":"Konfiguration!F11","v":"E-Mail:"},{"$f":"Konfiguration!G11","v":"marwitz@asta.uni-luebeck.de"}]
[null,{"$f":"Konfiguration!F12","v":"Telefonnummer:"},{"$f":"Konfiguration!G12","v":"+49 0000 0000000"}]
[]
[null,"Antragshöhe:",{"$f":"Abrechnung!F6","v":170}]
[null,{"$f":"IF(SUM(Konfiguration!D:D)>0,\"Kalkulierte Einnahmen:\",\"\")","v":"Kalkulierte Einnahmen:"},{"$f":"IF(SUM(Konfiguration!D:D)>0,SUM(Konfiguration!D:D),\"\")","v":20}]
[null,{"$f":"IF(Konfiguration!G6<>\"\",Konfiguration!F6,\"\")","v":"Veranstaltungsort:"},{"$f":"IF(Konfiguration!G6<>\"\",Konfiguration!G6,\"\")","v":"AM S4"}]
[null,{"$f":"IF(Konfiguration!G7<>\"\",Konfiguration!F7,\"\")","v":"Veranstaltungsdatum und -zeit:"},{"$f":"IF(Konfiguration!G7<>\"\",Konfiguration!G7,\"\")","v":"2022-12-24"}]
[]
[null,{"$f":"IF(Konfiguration!G14<>\"\",Konfiguration!F14,\"\")","v":"Finanzverantwortliche*r:"},{"$f":"IF(Konfiguration!G14<>\"\",Konfiguration!G14,\"\")","v":"Florian Marwitz"}]
[null,{"$f":"IF(Konfiguration!G15<>\"\",Konfiguration!F15,\"\")","v":"E-Mail:"},{"$f":"IF(Konfiguration!G15<>\"\",Konfiguration!G15,\"\")","v":"marwitz@asta.uni-luebeck.de"}]
[null,{"$f":"IF(Konfiguration!G16<>\"\",Konfiguration!F16,\"\")","v":"Telefonnummer:"},{"$f":"IF(Konfiguration!G16<>\"\",Konfiguration!G16,\"\")","v":"+49 0000 0000000"}]
[]
[null,{"$f":"Konfiguration!F18","v":"Antragsbegründung:"}]
[null,{"$f":"Konfiguration!G18","v":"Lorem ipsum dolor sit amet, consetetur sadipscing elitr, sed diam nonumy eirmod tempor invidunt ut labore et dolore magna aliquyam erat, sed diam voluptua. At vero eos et accusam et justo duo dolores et ea rebum. Stet clita kasd gubergren, no sea takimata sanctus est Lorem ipsum dolor sit amet. Lorem ipsum dolor sit amet, consetetur sadipscing elitr, sed diam nonumy eirmod tempor invidunt ut labore et dolore magna aliquyam erat, sed diam voluptua. At vero eos et accusam et justo duo dolores et ea rebum. Stet clita kasd gubergren, no sea takimata sanctus est Lorem ipsum dolor sit amet. Lorem ipsum dolor sit amet, consetetur sadipscing elitr, sed diam nonumy eirmod tempor invidunt ut labore et dolore magna aliquyam erat, sed diam voluptua. At vero eos et accusam et justo duo dolores et ea rebum. Stet clita kasd gubergren, no sea takimata sanctus est Lorem ipsum dolor sit amet. \nDuis autem vel eum iriure dolor in hendrerit in vulputate velit esse molestie consequat, vel illum dolore eu fa"}]
[]
[null,"Finanzübersicht"]
[]
[null,"Posten","Ausgaben","Einnahmen"]
[]
[null,{"$f":"IF(Konfiguration!B3=\"\",\"\",Konfiguration!B3)","v":"Snacks"},{"$f":"IF(Konfiguration!B3=\"\",\"\",Konfiguration!C3)","v":20},{"$f":"IF(Konfiguration!B3=\"\",\"\",Konfiguration!D3)","v":0}]
[null,{"$f":"IF(Konfiguration!B4=\"\",\"\",Konfiguration!B4)","v":"Getränke"},{"$f":"IF(Konfiguration!B4=\"\",\"\",Konfiguration!C4)","v":50},{"$f":"IF(Konfiguration!B4=\"\",\"\",Konfiguration!D4)","v":0}]
[null,{"$f":"IF(Konfiguration!B5=\"\",\"\",Konfiguration!B5)","v":"Spiele"},{"$f":"IF(Konfiguration!B5=\"\",\"\",Konfiguration!C5)","v":100},{"$f":"IF(Konfiguration!B5=\"\",\"\",Konfiguration!D5)","v":0}]
[null,{"$f":"IF(Konfiguration!B6=\"\",\"\",Konfiguration!B6)","v":"Ticketverkauf"},{"$f":"IF(Konfiguration!B6=\"\",\"\",Konfiguration!C6)","v":0},{"$f":"IF(Konfiguration!B6=\"\",\"\",Konfiguration!D6)","v":20}]
[null,{"$f":"IF(Konfiguration!B7=\"\",\"\",Konfiguration!B7)","v":""},{"$f":"IF(Konfiguration!B7=\"\",\"\",Konfiguration!C7)","v":""},{"$f":"IF(Konfiguration!B7=\"\",\"\",Konfiguration!D7)","v":""}]
[null,{"$f":"IF(Konfiguration!B8=\"\",\"\",Konfiguration!B8)","v":""},{"$f":"IF(Konfiguration!B8=\"\",\"\",Konfiguration!C8)","v":""},{"$f":"IF(Konfiguration!B8=\"\",\"\",Konfiguration!D8)","v":""}]
[null,{"$f":"IF(Konfiguration!B9=\"\",\"\",Konfiguration!B9)","v":""},{"$f":"IF(Konfiguration!B9=\"\",\"\",Konfiguration!C9)","v":""},{"$f":"IF(Konfiguration!B9=\"\",\"\",Konfiguration!D9)","v":""}]
[null,{"$f":"IF(Konfiguration!B10=\"\",\"\",Konfiguration!B10)","v":""},{"$f":"IF(Konfiguration!B10=\"\",\"\",Konfiguration!C10)","v":""},{"$f":"IF(Konfiguration!B10=\"\",\"\",Konfiguration!D10)","v":""}]
[null,{"$f":"IF(Konfiguration!B11=\"\",\"\",Konfiguration!B11)","v":""},{"$f":"IF(Konfiguration!B11=\"\",\"\",Konfiguration!C11)","v":""},{"$f":"IF(Konfiguration!B11=\"\",\"\",Konfiguration!D11)","v":""}]
[null,{"$f":"IF(Konfiguration!B12=\"\",\"\",Konfiguration!B12)","v":""},{"$f":"IF(Konfiguration!B12=\"\",\"\",Konfiguration!C12)","v":""},{"$f":"IF(Konfiguration!B12=\"\",\"\",Konfiguration!D12)","v":""}]
[null,{"$f":"IF(Konfiguration!B13=\"\",\"\",Konfiguration!B13)","v":""},{"$f":"IF(Konfiguration!B13=\"\",\"\",Konfiguration!C13)","v":""},{"$f":"IF(Konfiguration!B13=\"\",\"\",Konfiguration!D13)","v":""}]
[null,{"$f":"IF(Konfiguration!B14=\"\",\"\",Konfiguration!B14)","v":""},{"$f":"IF(Konfiguration!B14=\"\",\"\",Konfiguration!C14)","v":""},{"$f":"IF(Konfiguration!B14=\"\",\"\",Konfiguration!D14)","v":""}]
[null,{"$f":"IF(Konfiguration!B15=\"\",\"\",Konfiguration!B15)","v":""},{"$f":"IF(Konfiguration!B15=\"\",\"\",Konfiguration!C15)","v":""},{"$f":"IF(Konfiguration!B15=\"\",\"\",Konfiguration!D15)","v":""}]
[null,{"$f":"IF(Konfiguration!B16=\"\",\"\",Konfiguration!B16)","v":""},{"$f":"IF(Konfiguration!B16=\"\",\"\",Konfiguration!C16)","v":""},{"$f":"IF(Konfiguration!B16=\"\",\"\",Konfiguration!D16)","v":""}]
[null,{"$f":"IF(Konfiguration!B17=\"\",\"\",Konfiguration!B17)","v":""},{"$f":"IF(Konfiguration!B17=\"\",\"\",Konfiguration!C17)","v":""},{"$f":"IF(Konfiguration!B17=\"\",\"\",Konfiguration!D17)","v":""}]
[null,{"$f":"IF(Konfiguration!B18=\"\",\"\",Konfiguration!B18)","v":""},{"$f":"IF(Konfiguration!B18=\"\",\"\",Konfiguration!C18)","v":""},{"$f":"IF(Konfiguration!B18=\"\",\"\",Konfiguration!D18)","v":""}]
[null,{"$f":"IF(Konfiguration!B19=\"\",\"\",Konfiguration!B19)","v":""},{"$f":"IF(Konfiguration!B19=\"\",\"\",Konfiguration!C19)","v":""},{"$f":"IF(Konfiguration!B19=\"\",\"\",Konfiguration!D19)","v":""}]
[null,{"$f":"IF(Konfiguration!B20=\"\",\"\",Konfiguration!B20)","v":""},{"$f":"IF(Konfiguration!B20=\"\",\"\",Konfiguration!C20)","v":""},{"$f":"IF(Konfiguration!B20=\"\",\"\",Konfiguration!D20)","v":""}]
[null,{"$f":"IF(Konfiguration!B21=\"\",\"\",Konfiguration!B21)","v":""},{"$f":"IF(Konfiguration!B21=\"\",\"\",Konfiguration!C21)","v":""},{"$f":"IF(Konfiguration!B21=\"\",\"\",Konfiguration!D21)","v":""}]
[null,{"$f":"IF(Konfiguration!B22=\"\",\"\",Konfiguration!B22)","v":""},{"$f":"IF(Konfiguration!B22=\"\",\"\",Konfiguration!C22)","v":""},{"$f":"IF(Konfiguration!B22=\"\",\"\",Konfiguration!D22)","v":""}]
[null,{"$f":"IF(Konfiguration!B23=\"\",\"\",Konfiguration!B23)","v":""},{"$f":"IF(Konfiguration!B23=\"\",\"\",Konfiguration!C23)","v":""},{"$f":"IF(Konfiguration!B23=\"\",\"\",Konfiguration!D23)","v":""}]
[null,{"$f":"IF(Konfiguration!B24=\"\",\"\",Konfiguration!B24)","v":""},{"$f":"IF(Konfiguration!B24=\"\",\"\",Konfiguration!C24)","v":""},{"$f":"IF(Konfiguration!B24=\"\",\"\",Konfiguration!D24)","v":""}]
[null,{"$f":"IF(Konfiguration!B25=\"\",\"\",Konfiguration!B25)","v":""},{"$f":"IF(Konfiguration!B25=\"\",\"\",Konfiguration!C25)","v":""},{"$f":"IF(Konfiguration!B25=\"\",\"\",Konfiguration!D25)","v":""}]
[null,{"$f":"IF(Konfiguration!B26=\"\",\"\",Konfiguration!B26)","v":""},{"$f":"IF(Konfiguration!B26=\"\",\"\",Konfiguration!C26)","v":""},{"$f":"IF(Konfiguration!B26=\"\",\"\",Konfiguration!D26)","v":""}]
[null,{"$f":"IF(Konfiguration!B27=\"\",\"\",Konfiguration!B27)","v":""},{"$f":"IF(Konfiguration!B27=\"\",\"\",Konfiguration!C27)","v":""},{"$f":"IF(Konfiguration!B27=\"\",\"\",Konfiguration!D27)","v":""}]
[null,{"$f":"IF(Konfiguration!B28=\"\",\"\",Konfiguration!B28)","v":""},{"$f":"IF(Konfiguration!B28=\"\",\"\",Konfiguration!C28)","v":""},{"$f":"IF(Konfiguration!B28=\"\",\"\",Konfiguration!D28)","v":""}]
[null,{"$f":"IF(Konfiguration!B29=\"\",\"\",Konfiguration!B29)","v":""},{"$f":"IF(Konfiguration!B29=\"\",\"\",Konfiguration!C29)","v":""},{"$f":"IF(Konfiguration!B29=\"\",\"\",Konfiguration!D29)","v":""}]
[null,{"$f":"IF(Konfiguration!B30=\"\",\"\",Konfiguration!B30)","v":""},{"$f":"IF(Konfiguration!B30=\"\",\"\",Konfiguration!C30)","v":""},{"$f":"IF(Konfiguration!B30=\"\",\"\",Konfiguration!D30)","v":""}]
[null,{"$f":"IF(Konfiguration!B31=\"\",\"\",Konfiguration!B31)","v":""},{"$f":"IF(Konfiguration!B31=\"\",\"\",Konfiguration!C31)","v":""},{"$f":"IF(Konfiguration!B31=\"\",\"\",Konfiguration!D31)","v":""}]
[null,{"$f":"IF(Konfiguration!B32=\"\",\"\",Konfiguration!B32)","v":""},{"$f":"IF(Konfiguration!B32=\"\",\"\",Konfiguration!C32)","v":""},{"$f":"IF(Konfiguration!B32=\"\",\"\",Konfiguration!D32)","v":""}]
[null,{"$f":"IF(Konfiguration!B33=\"\",\"\",Konfiguration!B33)","v":""},{"$f":"IF(Konfiguration!B33=\"\",\"\",Konfiguration!C33)","v":""},{"$f":"IF(Konfiguration!B33=\"\",\"\",Konfiguration!D33)","v":""}]
[null,{"$f":"IF(Konfiguration!B34=\"\",\"\",Konfiguration!B34)","v":""},{"$f":"IF(Konfiguration!B34=\"\",\"\",Konfiguration!C34)","v":""},{"$f":"IF(Konfiguration!B34=\"\",\"\",Konfiguration!D34)","v":""}]
[null,{"$f":"IF(Konfiguration!B35=\"\",\"\",Konfiguration!B35)","v":""},{"$f":"IF(Konfiguration!B35=\"\",\"\",Konfiguration!C35)","v":""},{"$f":"IF(Konfiguration!B35=\"\",\"\",Konfiguration!D35)","v":""}]
[null,{"$f":"IF(Konfiguration!B36=\"\",\"\",Konfiguration!B36)","v":""},{"$f":"IF(Konfiguration!B36=\"\",\"\",Konfiguration!C36)","v":""},{"$f":"IF(Konfiguration!B36=\"\",\"\",Konfiguration!D36)","v":""}]
[null,{"$f":"IF(Konfiguration!B37=\"\",\"\",Konfiguration!B37)","v":""},{"$f":"IF(Konfiguration!B37=\"\",\"\",Konfiguration!C37)","v":""},{"$f":"IF(Konfiguration!B37=\"\",\"\",Konfiguration!D37)","v":""}]
[null,{"$f":"IF(Konfiguration!B38=\"\",\"\",Konfiguration!B38)","v":""},{"$f":"IF(Konfiguration!B38=\"\",\"\",Konfiguration!C38)","v":""},{"$f":"IF(Konfiguration!B38=\"\",\"\",Konfiguration!D38)","v":""}]
[null,{"$f":"IF(Konfiguration!B39=\"\",\"\",Konfiguration!B39)","v":""},{"$f":"IF(Konfiguration!B39=\"\",\"\",Konfiguration!C39)","v":""},{"$f":"IF(Konfiguration!B39=\"\",\"\",Konfiguration!D39)","v":""}]
[null,{"$f":"IF(Konfiguration!B40=\"\",\"\",Konfiguration!B40)","v":""},{"$f":"IF(Konfiguration!B40=\"\",\"\",Konfiguration!C40)","v":""},{"$f":"IF(Konfiguration!B40=\"\",\"\",Konfiguration!D40)","v":""}]
[null,{"$f":"IF(Konfiguration!B41=\"\",\"\",Konfiguration!B41)","v":""},{"$f":"IF(Konfiguration!B41=\"\",\"\",Konfiguration!C41)","v":""},{"$f":"IF(Konfiguration!B41=\"\",\"\",Konfiguration!D41)","v":""}]
[null,{"$f":"IF(Konfiguration!B42=\"\",\"\",Konfiguration!B42)","v":""},{"$f":"IF(Konfiguration!B42=\"\",\"\",Konfiguration!C42)","v":""},{"$f":"IF(Konfiguration!B42=\"\",\"\",Konfiguration!D42)","v":""}]
[null,{"$f":"IF(Konfiguration!B43=\"\",\"\",Konfiguration!B43)","v":""},{"$f":"IF(Konfiguration!B43=\"\",\"\",Konfiguration!C43)","v":""},{"$f":"IF(Konfiguration!B43=\"\",\"\",Konfiguration!D43)","v":""}]
[null,{"$f":"IF(Konfiguration!B44=\"\",\"\",Konfiguration!B44)","v":""},{"$f":"IF(Konfiguration!B44=\"\",\"\",Konfiguration!C44)","v":""},{"$f":"IF(Konfiguration!B44=\"\",\"\",Konfiguration!D44)","v":""}]
[null,{"$f":"IF(Konfiguration!B45=\"\",\"\",Konfiguration!B45)","v":""},{"$f":"IF(Konfiguration!B45=\"\",\"\",Konfiguration!C45)","v":""},{"$f":"IF(Konfiguration!B45=\"\",\"\",Konfiguration!D45)","v":""}]
[null,{"$f":"IF(Konfiguration!B46=\"\",\"\",Konfiguration!B46)","v":""},{"$f":"IF(Konfiguration!B46=\"\",\"\",Konfiguration!C46)","v":""},{"$f":"IF(Konfiguration!B46=\"\",\"\",Konfiguration!D46)","v":""}]
[null,{"$f":"IF(Konfiguration!B47=\"\",\"\",Konfiguration!B47)","v":""},{"$f":"IF(Konfiguration!B47=\"\",\"\",Konfiguration!C47)","v":""},{"$f":"IF(Konfiguration!B47=\"\",\"\",Konfiguration!D47)","v":""}]
[null,{"$f":"IF(Konfiguration!B48=\"\",\"\",Konfiguration!B48)","v":""},{"$f":"IF(Konfiguration!B48=\"\",\"\",Konfiguration!C48)","v":""},{"$f":"IF(Konfiguration!B48=\"\",\"\",Konfiguration!D48)","v":""}]
[null,{"$f":"IF(Konfiguration!B49=\"\",\"\",Konfiguration!B49)","v":""},{"$f":"IF(Konfiguration!B49=\"\",\"\",Konfiguration!C49)","v":""},{"$f":"IF(Konfiguration!B49=\"\",\"\",Konfiguration!D49)","v":""}]
[null,{"$f":"IF(Konfiguration!B50=\"\",\"\",Konfiguration!B50)","v":""},{"$f":"IF(Konfiguration!B50=\"\",\"\",Konfiguration!C50)","v":""},{"$f":"IF(Konfiguration!B50=\"\",\"\",Konfiguration!D50)","v":""}]
[null,{"$f":"IF(Konfiguration!B51=\"\",\"\",Konfiguration!B51)","v":""},{"$f":"IF(Konfiguration!B51=\"\",\"\",Konfiguration!C51)","v":""},{"$f":"IF(Konfiguration!B51=\"\",\"\",Konfiguration!D51)","v":""}]
[null,{"$f":"IF(Konfiguration!B52=\"\",\"\",Konfiguration!B52)","v":""},{"$f":"IF(Konfiguration!B52=\"\",\"\",Konfiguration!C52)","v":""},{"$f":"IF(Konfiguration!B52=\"\",\"\",Konfiguration!D52)","v":""}]
[null,{"$f":"IF(Konfiguration!B53=\"\",\"\",Konfiguration!B53)","v":""},{"$f":"IF(Konfiguration!B53=\"\",\"\",Konfiguration!C53)","v":""},{"$f":"IF(Konfiguration!B53=\"\",\"\",Konfiguration!D53)","v":""}]
[null,{"$f":"IF(Konfiguration!B54=\"\",\"\",Konfiguration!B54)","v":""},{"$f":"IF(Konfiguration!B54=\"\",\"\",Konfiguration!C54)","v":""},{"$f":"IF(Konfiguration!B54=\"\",\"\",Konfiguration!D54)","v":""}]
[null,{"$f":"IF(Konfiguration!B55=\"\",\"\",Konfiguration!B55)","v":""},{"$f":"IF(Konfiguration!B55=\"\",\"\",Konfiguration!C55)","v":""},{"$f":"IF(Konfiguration!B55=\"\",\"\",Konfiguration!D55)","v":""}]
[null,{"$f":"IF(Konfiguration!B56=\"\",\"\",Konfiguration!B56)","v":""},{"$f":"IF(Konfiguration!B56=\"\",\"\",Konfiguration!C56)","v":""},{"$f":"IF(Konfiguration!B56=\"\",\"\",Konfiguration!D56)","v":""}]
[null,{"$f":"IF(Konfiguration!B57=\"\",\"\",Konfiguration!B57)","v":""},{"$f":"IF(Konfiguration!B57=\"\",\"\",Konfiguration!C57)","v":""},{"$f":"IF(Konfiguration!B57=\"\",\"\",Konfiguration!D57)","v":""}]
[null,{"$f":"IF(Konfiguration!B58=\"\",\"\",Konfiguration!B58)","v":""},{"$f":"IF(Konfiguration!B58=\"\",\"\",Konfiguration!C58)","v":""},{"$f":"IF(Konfiguration!B58=\"\",\"\",Konfiguration!D58)","v":""}]
[null,{"$f":"IF(Konfiguration!B59=\"\",\"\",Konfiguration!B59)","v":""},{"$f":"IF(Konfiguration!B59=\"\",\"\",Konfiguration!C59)","v":""},{"$f":"IF(Konfiguration!B59=\"\",\"\",Konfiguration!D59)","v":""}]
[null,{"$f":"IF(Konfiguration!B60=\"\",\"\",Konfiguration!B60)","v":""},{"$f":"IF(Konfiguration!B60=\"\",\"\",Konfiguration!C60)","v":""},{"$f":"IF(Konfiguration!B60=\"\",\"\",Konfiguration!D60)","v":""}]
[null,{"$f":"IF(Konfiguration!B61=\"\",\"\",Konfiguration!B61)","v":""},{"$f":"IF(Konfiguration!B61=\"\",\"\",Konfiguration!C61)","v":""},{"$f":"IF(Konfiguration!B61=\"\",\"\",Konfiguration!D61)","v":""}]
[null,{"$f":"IF(Konfiguration!B62=\"\",\"\",Konfiguration!B62)","v":""},{"$f":"IF(Konfiguration!B62=\"\",\"\",Konfiguration!C62)","v":""},{"$f":"IF(Konfiguration!B62=\"\",\"\",Konfiguration!D62)","v":""}]
[null,{"$f":"IF(Konfiguration!B63=\"\",\"\",Konfiguration!B63)","v":""},{"$f":"IF(Konfiguration!B63=\"\",\"\",Konfiguration!C63)","v":""},{"$f":"IF(Konfiguration!B63=\"\",\"\",Konfiguration!D63)","v":""}]
[null,{"$f":"IF(Konfiguration!B64=\"\",\"\",Konfiguration!B64)","v":""},{"$f":"IF(Konfiguration!B64=\"\",\"\",Konfiguration!C64)","v":""},{"$f":"IF(Konfiguration!B64=\"\",\"\",Konfiguration!D64)","v":""}]
[null,{"$f":"IF(Konfiguration!B65=\"\",\"\",Konfiguration!B65)","v":""},{"$f":"IF(Konfiguration!B65=\"\",\"\",Konfiguration!C65)","v":""},{"$f":"IF(Konfiguration!B65=\"\",\"\",Konfiguration!D65)","v":""}]
[null,{"$f":"IF(Konfiguration!B66=\"\",\"\",Konfiguration!B66)","v":""},{"$f":"IF(Konfiguration!B66=\"\",\"\",Konfiguration!C66)","v":""},{"$f":"IF(Konfiguration!B66=\"\",\"\",Konfiguration!D66)","v":""}]
[null,{"$f":"IF(Konfiguration!B67=\"\",\"\",Konfiguration!B67)","v":""},{"$f":"IF(Konfiguration!B67=\"\",\"\",Konfiguration!C67)","v":""},{"$f":"IF(Konfiguration!B67=\"\",\"\",Konfiguration!D67)","v":""}]
[null,{"$f":"IF(Konfiguration!B68=\"\",\"\",Konfiguration!B68)","v":""},{"$f":"IF(Konfiguration!B68=\"\",\"\",Konfiguration!C68)","v":""},{"$f":"IF(Konfiguration!B68=\"\",\"\",Konfiguration!D68)","v":""}]
[null,{"$f":"IF(Konfiguration!B69=\"\",\"\",Konfiguration!B69)","v":""},{"$f":"IF(Konfiguration!B69=\"\",\"\",Konfiguration!C69)","v":""},{"$f":"IF(Konfiguration!B69=\"\",\"\",Konfiguration!D69)","v":""}]
[null,{"$f":"IF(Konfiguration!B70=\"\",\"\",Konfiguration!B70)","v":""},{"$f":"IF(Konfiguration!B70=\"\",\"\",Konfiguration!C70)","v":""},{"$f":"IF(Konfiguration!B70=\"\",\"\",Konfiguration!D70)","v":""}]
[null,{"$f":"IF(Konfiguration!B71=\"\",\"\",Konfiguration!B71)","v":""},{"$f":"IF(Konfiguration!B71=\"\",\"\",Konfiguration!C71)","v":""},{"$f":"IF(Konfiguration!B71=\"\",\"\",Konfiguration!D71)","v":""}]
[null,{"$f":"IF(Konfiguration!B72=\"\",\"\",Konfiguration!B72)","v":""},{"$f":"IF(Konfiguration!B72=\"\",\"\",Konfiguration!C72)","v":""},{"$f":"IF(Konfiguration!B72=\"\",\"\",Konfiguration!D72)","v":""}]
[null,{"$f":"IF(Konfiguration!B73=\"\",\"\",Konfiguration!B73)","v":""},{"$f":"IF(Konfiguration!B73=\"\",\"\",Konfiguration!C73)","v":""},{"$f":"IF(Konfiguration!B73=\"\",\"\",Konfiguration!D73)","v":""}]
[null,{"$f":"IF(Konfiguration!B74=\"\",\"\",Konfiguration!B74)","v":""},{"$f":"IF(Konfiguration!B74=\"\",\"\",Konfiguration!C74)","v":""},{"$f":"IF(Konfiguration!B74=\"\",\"\",Konfiguration!D74)","v":""}]
[null,{"$f":"IF(Konfiguration!B75=\"\",\"\",Konfiguration!B75)","v":""},{"$f":"IF(Konfiguration!B75=\"\",\"\",Konfiguration!C75)","v":""},{"$f":"IF(Konfiguration!B75=\"\",\"\",Konfiguration!D75)","v":""}]
[null,{"$f":"IF(Konfiguration!B76=\"\",\"\",Konfiguration!B76)","v":""},{"$f":"IF(Konfiguration!B76=\"\",\"\",Konfiguration!C76)","v":""},{"$f":"IF(Konfiguration!B76=\"\",\"\",Konfiguration!D76)","v":""}]
[null,{"$f":"IF(Konfiguration!B77=\"\",\"\",Konfiguration!B77)","v":""},{"$f":"IF(Konfiguration!B77=\"\",\"\",Konfiguration!C77)","v":""},{"$f":"IF(Konfiguration!B77=\"\",\"\",Konfiguration!D77)","v":""}]
[null,{"$f":"IF(Konfiguration!B78=\"\",\"\",Konfiguration!B78)","v":""},{"$f":"IF(Konfiguration!B78=\"\",\"\",Konfiguration!C78)","v":""},{"$f":"IF(Konfiguration!B78=\"\",\"\",Konfiguration!D78)","v":""}]
[null,{"$f":"IF(Konfiguration!B79=\"\",\"\",Konfiguration!B79)","v":""},{"$f":"IF(Konfiguration!B79=\"\",\"\",Konfiguration!C79)","v":""},{"$f":"IF(Konfiguration!B79=\"\",\"\",Konfiguration!D79)","v":""}]
[null,{"$f":"IF(Konfiguration!B80=\"\",\"\",Konfiguration!B80)","v":""},{"$f":"IF(Konfiguration!B80=\"\",\"\",Konfiguration!C80)","v":""},{"$f":"IF(Konfiguration!B80=\"\",\"\",Konfiguration!D80)","v":""}]
[null,{"$f":"IF(Konfiguration!B81=\"\",\"\",Konfiguration!B81)","v":""},{"$f":"IF(Konfiguration!B81=\"\",\"\",Konfiguration!C81)","v":""},{"$f":"IF(Konfiguration!B81=\"\",\"\",Konfiguration!D81)","v":""}]
[null,{"$f":"IF(Konfiguration!B82=\"\",\"\",Konfiguration!B82)","v":""},{"$f":"IF(Konfiguration!B82=\"\",\"\",Konfiguration!C82)","v":""},{"$f":"IF(Konfiguration!B82=\"\",\"\",Konfiguration!D82)","v":""}]
[null,{"$f":"IF(Konfiguration!B83=\"\",\"\",Konfiguration!B83)","v":""},{"$f":"IF(Konfiguration!B83=\"\",\"\",Konfiguration!C83)","v":""},{"$f":"IF(Konfiguration!B83=\"\",\"\",Konfiguration!D83)","v":""}]
[null,{"$f":"IF(Konfiguration!B84=\"\",\"\",Konfiguration!B84)","v":""},{"$f":"IF(Konfiguration!B84=\"\",\"\",Konfiguration!C84)","v":""},{"$f":"IF(Konfiguration!B84=\"\",\"\",Konfiguration!D84)","v":""}]
[null,{"$f":"IF(Konfiguration!B85=\"\",\"\",Konfiguration!B85)","v":""},{"$f":"IF(Konfiguration!B85=\"\",\"\",Konfiguration!C85)","v":""},{"$f":"IF(Konfiguration!B85=\"\",\"\",Konfiguration!D85)","v":""}]
[null,{"$f":"IF(Konfiguration!B86=\"\",\"\",Konfiguration!B86)","v":""},{"$f":"IF(Konfiguration!B86=\"\",\"\",Konfiguration!C86)","v":""},{"$f":"IF(Konfiguration!B86=\"\",\"\",Konfiguration!D86)","v":""}]
[null,{"$f":"IF(Konfiguration!B87=\"\",\"\",Konfiguration!B87)","v":""},{"$f":"IF(Konfiguration!B87=\"\",\"\",Konfiguration!C87)","v":""},{"$f":"IF(Konfiguration!B87=\"\",\"\",Konfiguration!D87)","v":""}]
[null,{"$f":"IF(Konfiguration!B88=\"\",\"\",Konfiguration!B88)","v":""},{"$f":"IF(Konfiguration!B88=\"\",\"\",Konfiguration!C88)","v":""},{"$f":"IF(Konfiguration!B88=\"\",\"\",Konfiguration!D88)","v":""}]
[null,{"$f":"IF(Konfiguration!B89=\"\",\"\",Konfiguration!B89)","v":""},{"$f":"IF(Konfiguration!B89=\"\",\"\",Konfiguration!C89)","v":""},{"$f":"IF(Konfiguration!B89=\"\",\"\",Konfiguration!D89)","v":""}]
[null,{"$f":"IF(Konfiguration!B90=\"\",\"\",Konfiguration!B90)","v":""},{"$f":"IF(Konfiguration!B90=\"\",\"\",Konfiguration!C90)","v":""},{"$f":"IF(Konfiguration!B90=\"\",\"\",Konfiguration!D90)","v":""}]
[null,{"$f":"IF(Konfiguration!B91=\"\",\"\",Konfiguration!B91)","v":""},{"$f":"IF(Konfiguration!B91=\"\",\"\",Konfiguration!C91)","v":""},{"$f":"IF(Konfiguration!B91=\"\",\"\",Konfiguration!D91)","v":""}]
[null,{"$f":"IF(Konfiguration!B92=\"\",\"\",Konfiguration!B92)","v":""},{"$f":"IF(Konfiguration!B92=\"\",\"\",Konfiguration!C92)","v":""},{"$f":"IF(Konfiguration!B92=\"\",\"\",Konfiguration!D92)","v":""}]
[null,{"$f":"IF(Konfiguration!B93=\"\",\"\",Konfiguration!B93)","v":""},{"$f":"IF(Konfiguration!B93=\"\",\"\",Konfiguration!C93)","v":""},{"$f":"IF(Konfiguration!B93=\"\",\"\",Konfiguration!D93)","v":""}]
[null,{"$f":"IF(Konfiguration!B94=\"\",\"\",Konfiguration!B94)","v":""},{"$f":"IF(Konfiguration!B94=\"\",\"\",Konfiguration!C94)","v":""},{"$f":"IF(Konfiguration!B94=\"\",\"\",Konfiguration!D94)","v":""}]
[null,{"$f":"IF(Konfiguration!B95=\"\",\"\",Konfiguration!B95)","v":""},{"$f":"IF(Konfiguration!B95=\"\",\"\",Konfiguration!C95)","v":""},{"$f":"IF(Konfiguration!B95=\"\",\"\",Konfiguration!D95)","v":""}]
[null,{"$f":"IF(Konfiguration!B96=\"\",\"\",Konfiguration!B96)","v":""},{"$f":"IF(Konfiguration!B96=\"\",\"\",Konfiguration!C96)","v":""},{"$f":"IF(Konfiguration!B96=\"\",\"\",Konfiguration!D96)","v":""}]
[null,{"$f":"IF(Konfiguration!B97=\"\",\"\",Konfiguration!B97)","v":""},{"$f":"IF(Konfiguration!B97=\"\",\"\",Konfiguration!C97)","v":""},{"$f":"IF(Konfiguration!B97=\"\",\"\",Konfiguration!D97)","v":""}]
[null,{"$f":"IF(Konfiguration!B98=\"\",\"\",Konfiguration!B98)","v":""},{"$f":"IF(Konfiguration!B98=\"\",\"\",Konfiguration!C98)","v":""},{"$f":"IF(Konfiguration!B98=\"\",\"\",Konfiguration!D98)","v":""}]
[null,{"$f":"IF(Konfiguration!B99=\"\",\"\",Konfiguration!B99)","v":""},{"$f":"IF(Konfiguration!B99=\"\",\"\",Konfiguration!C99)","v":""},{"$f":"IF(Konfiguration!B99=\"\",\"\",Konfiguration!D99)","v":""}]
[null,{"$f":"IF(Konfiguration!B100=\"\",\"\",Konfiguration!B100)","v":""},{"$f":"IF(Konfiguration!B100=\"\",\"\",Konfiguration!C100)","v":""},{"$f":"IF(Konfiguration!B100=\"\",\"\",Konfiguration!D100)","v":""}]
[null,{"$f":"IF(Konfiguration!B101=\"\",\"\",Konfiguration!B101)","v":""},{"$f":"IF(Konfiguration!B101=\"\",\"\",Konfiguration!C101)","v":""},{"$f":"IF(Konfiguration!B101=\"\",\"\",Konfiguration!D101)","v":""}]
[null,{"$f":"IF(Konfiguration!B102=\"\",\"\",Konfiguration!B102)","v":""},{"$f":"IF(Konfiguration!B102=\"\",\"\",Konfiguration!C102)","v":""},{"$f":"IF(Konfiguration!B102=\"\",\"\",Konfiguration!D102)","v":""}]
[null,{"$f":"IF(Konfiguration!B103=\"\",\"\",Konfiguration!B103)","v":""},{"$f":"IF(Konfiguration!B103=\"\",\"\",Konfiguration!C103)","v":""},{"$f":"IF(Konfiguration!B103=\"\",\"\",Konfiguration!D103)","v":""}]
[null,{"$f":"IF(Konfiguration!B104=\"\",\"\",Konfiguration!B104)","v":""},{"$f":"IF(Konfiguration!B104=\"\",\"\",Konfiguration!C104)","v":""},{"$f":"IF(Konfiguration!B104=\"\",\"\",Konfiguration!D104)","v":""}]
[null,{"$f":"IF(Konfiguration!B105=\"\",\"\",Konfiguration!B105)","v":""},{"$f":"IF(Konfiguration!B105=\"\",\"\",Konfiguration!C105)","v":""},{"$f":"IF(Konfiguration!B105=\"\",\"\",Konfiguration!D105)","v":""}]
[null,{"$f":"IF(Konfiguration!B106=\"\",\"\",Konfiguration!B106)","v":""},{"$f":"IF(Konfiguration!B106=\"\",\"\",Konfiguration!C106)","v":""},{"$f":"IF(Konfiguration!B106=\"\",\"\",Konfiguration!D106)","v":""}]
[null,{"$f":"IF(Konfiguration!B107=\"\",\"\",Konfiguration!B107)","v":""},{"$f":"IF(Konfiguration!B107=\"\",\"\",Konfiguration!C107)","v":""},{"$f":"IF(Konfiguration!B107=\"\",\"\",Konfiguration!D107)","v":""}]
[null,{"$f":"IF(Konfiguration!B108=\"\",\"\",Konfiguration!B108)","v":""},{"$f":"IF(Konfiguration!B108=\"\",\"\",Konfiguration!C108)","v":""},{"$f":"IF(Konfiguration!B108=\"\",\"\",Konfiguration!D108)","v":""}]
[null,{"$f":"IF(Konfiguration!B109=\"\",\"\",Konfiguration!B109)","v":""},{"$f":"IF(Konfiguration!B109=\"\",\"\",Konfiguration!C109)","v":""},{"$f":"IF(Konfiguration!B109=\"\",\"\",Konfiguration!D109)","v":""}]
[null,{"$f":"IF(Konfiguration!B110=\"\",\"\",Konfiguration!B110)","v":""},{"$f":"IF(Konfiguration!B110=\"\",\"\",Konfiguration!C110)","v":""},{"$f":"IF(Konfiguration!B110=\"\",\"\",Konfiguration!D110)","v":""}]
[null,{"$f":"IF(Konfiguration!B111=\"\",\"\",Konfiguration!B111)","v":""},{"$f":"IF(Konfiguration!B111=\"\",\"\",Konfiguration!C111)","v":""},{"$f":"IF(Konfiguration!B111=\"\",\"\",Konfiguration!D111)","v":""}]
[null,{"$f":"IF(Konfiguration!B112=\"\",\"\",Konfiguration!B112)","v":""},{"$f":"IF(Konfiguration!B112=\"\",\"\",Konfiguration!C112)","v":""},{"$f":"IF(Konfiguration!B112=\"\",\"\",Konfiguration!D112)","v":""}]
[null,{"$f":"IF(Konfiguration!B113=\"\",\"\",Konfiguration!B113)","v":""},{"$f":"IF(Konfiguration!B113=\"\",\"\",Konfiguration!C113)","v":""},{"$f":"IF(Konfiguration!B113=\"\",\"\",Konfiguration!D113)","v":""}]
[null,{"$f":"IF(Konfiguration!B114=\"\",\"\",Konfiguration!B114)","v":""},{"$f":"IF(Konfiguration!B114=\"\",\"\",Konfiguration!C114)","v":""},{"$f":"IF(Konfiguration!B114=\"\",\"\",Konfiguration!D114)","v":""}]
[null,{"$f":"IF(Konfiguration!B115=\"\",\"\",Konfiguration!B115)","v":""},{"$f":"IF(Konfiguration!B115=\"\",\"\",Konfiguration!C115)","v":""},{"$f":"IF(Konfiguration!B115=\"\",\"\",Konfiguration!D115)","v":""}]
[null,{"$f":"IF(Konfiguration!B116=\"\",\"\",Konfiguration!B116)","v":""},{"$f":"IF(Konfiguration!B116=\"\",\"\",Konfiguration!C116)","v":""},{"$f":"IF(Konfiguration!B116=\"\",\"\",Konfiguration!D116)","v":""}]
[null,{"$f":"IF(Konfiguration!B117=\"\",\"\",Konfiguration!B117)","v":""},{"$f":"IF(Konfiguration!B117=\"\",\"\",Konfiguration!C117)","v":""},{"$f":"IF(Konfiguration!B117=\"\",\"\",Konfiguration!D117)","v":""}]
[null,{"$f":"IF(Konfiguration!B118=\"\",\"\",Konfiguration!B118)","v":""},{"$f":"IF(Konfiguration!B118=\"\",\"\",Konfiguration!C118)","v":""},{"$f":"IF(Konfiguration!B118=\"\",\"\",Konfiguration!D118)","v":""}]
[null,{"$f":"IF(Konfiguration!B119=\"\",\"\",Konfiguration!B119)","v":""},{"$f":"IF(Konfiguration!B119=\"\",\"\",Konfiguration!C119)","v":""},{"$f":"IF(Konfiguration!B119=\"\",\"\",Konfiguration!D119)","v":""}]
[null,{"$f":"IF(Konfiguration!B120=\"\",\"\",Konfiguration!B120)","v":""},{"$f":"IF(Konfiguration!B120=\"\",\"\",Konfiguration!C120)","v":""},{"$f":"IF(Konfiguration!B120=\"\",\"\",Konfiguration!D120)","v":""}]
[null,{"$f":"IF(Konfiguration!B121=\"\",\"\",Konfiguration!B121)","v":""},{"$f":"IF(Konfiguration!B121=\"\",\"\",Konfiguration!C121)","v":""},{"$f":"IF(Konfiguration!B121=\"\",\"\",Konfiguration!D121)","v":""}]
[null,{"$f":"IF(Konfiguration!B122=\"\",\"\",Konfiguration!B122)","v":""},{"$f":"IF(Konfiguration!B122=\"\",\"\",Konfiguration!C122)","v":""},{"$f":"IF(Konfiguration!B122=\"\",\"\",Konfiguration!D122)","v":""}]
[null,{"$f":"IF(Konfiguration!B123=\"\",\"\",Konfiguration!B123)","v":""},{"$f":"IF(Konfiguration!B123=\"\",\"\",Konfiguration!C123)","v":""},{"$f":"IF(Konfiguration!B123=\"\",\"\",Konfiguration!D123)","v":""}]
[null,{"$f":"IF(Konfiguration!B124=\"\",\"\",Konfiguration!B124)","v":""},{"$f":"IF(Konfiguration!B124=\"\",\"\",Konfiguration!C124)","v":""},{"$f":"IF(Konfiguration!B124=\"\",\"\",Konfiguration!D124)","v":""}]
[null,{"$f":"IF(Konfiguration!B125=\"\",\"\",Konfiguration!B125)","v":""},{"$f":"IF(Konfiguration!B125=\"\",\"\",Konfiguration!C125)","v":""},{"$f":"IF(Konfiguration!B125=\"\",\"\",Konfiguration!D125)","v":""}]
[null,{"$f":"IF(Konfiguration!B126=\"\",\"\",Konfiguration!B126)","v":""},{"$f":"IF(Konfiguration!B126=\"\",\"\",Konfiguration!C126)","v":""},{"$f":"IF(Konfiguration!B126=\"\",\"\",Konfiguration!D126)","v":""}]
[null,{"$f":"IF(Konfiguration!B127=\"\",\"\",Konfiguration!B127)","v":""},{"$f":"IF(Konfiguration!B127=\"\",\"\",Konfiguration!C127)","v":""},{"$f":"IF(Konfiguration!B127=\"\",\"\",Konfiguration!D127)","v":""}]
[null,{"$f":"IF(Konfiguration!B128=\"\",\"\",Konfiguration!B128)","v":""},{"$f":"IF(Konfiguration!B128=\"\",\"\",Konfiguration!C128)","v":""},{"$f":"IF(Konfiguration!B128=\"\",\"\",Konfiguration!D128)","v":""}]
[null,{"$f":"IF(Konfiguration!B129=\"\",\"\",Konfiguration!B129)","v":""},{"$f":"IF(Konfiguration!B129=\"\",\"\",Konfiguration!C129)","v":""},{"$f":"IF(Konfiguration!B129=\"\",\"\",Konfiguration!D129)","v":""}]
[null,{"$f":"IF(Konfiguration!B130=\"\",\"\",Konfiguration!B130)","v":""},{"$f":"IF(Konfiguration!B130=\"\",\"\",Konfiguration!C130)","v":""},{"$f":"IF(Konfiguration!B130=\"\",\"\",Konfiguration!D130)","v":""}]
[null,{"$f":"IF(Konfiguration!B131=\"\",\"\",Konfiguration!B131)","v":""},{"$f":"IF(Konfiguration!B131=\"\",\"\",Konfiguration!C131)","v":""},{"$f":"IF(Konfiguration!B131=\"\",\"\",Konfiguration!D131)","v":""}]
[null,{"$f":"IF(Konfiguration!B132=\"\",\"\",Konfiguration!B132)","v":""},{"$f":"IF(Konfiguration!B132=\"\",\"\",Konfiguration!C132)","v":""},{"$f":"IF(Konfiguration!B132=\"\",\"\",Konfiguration!D132)","v":""}]
[null,{"$f":"IF(Konfiguration!B133=\"\",\"\",Konfiguration!B133)","v":""},{"$f":"IF(Konfiguration!B133=\"\",\"\",Konfiguration!C133)","v":""},{"$f":"IF(Konfiguration!B133=\"\",\"\",Konfiguration!D133)","v":""}]
[null,{"$f":"IF(Konfiguration!B134=\"\",\"\",Konfiguration!B134)","v":""},{"$f":"IF(Konfiguration!B134=\"\",\"\",Konfiguration!C134)","v":""},{"$f":"IF(Konfiguration!B134=\"\",\"\",Konfiguration!D134)","v":""}]
[null,{"$f":"IF(Konfiguration!B135=\"\",\"\",Konfiguration!B135)","v":""},{"$f":"IF(Konfiguration!B135=\"\",\"\",Konfiguration!C135)","v":""},{"$f":"IF(Konfiguration!B135=\"\",\"\",Konfiguration!D135)","v":""}]
[null,{"$f":"IF(Konfiguration!B136=\"\",\"\",Konfiguration!B136)","v":""},{"$f":"IF(Konfiguration!B136=\"\",\"\",Konfiguration!C136)","v":""},{"$f":"IF(Konfiguration!B136=\"\",\"\",Konfiguration!D136)","v":""}]
[null,{"$f":"IF(Konfiguration!B137=\"\",\"\",Konfiguration!B137)","v":""},{"$f":"IF(Konfiguration!B137=\"\",\"\",Konfiguration!C137)","v":""},{"$f":"IF(Konfiguration!B137=\"\",\"\",Konfiguration!D137)","v":""}]
[null,{"$f":"IF(Konfiguration!B138=\"\",\"\",Konfiguration!B138)","v":""},{"$f":"IF(Konfiguration!B138=\"\",\"\",Konfiguration!C138)","v":""},{"$f":"IF(Konfiguration!B138=\"\",\"\",Konfiguration!D138)","v":""}]
[null,{"$f":"IF(Konfiguration!B139=\"\",\"\",Konfiguration!B139)","v":""},{"$f":"IF(Konfiguration!B139=\"\",\"\",Konfiguration!C139)","v":""},{"$f":"IF(Konfiguration!B139=\"\",\"\",Konfiguration!D139)","v":""}]
[null,{"$f":"IF(Konfiguration!B140=\"\",\"\",Konfiguration!B140)","v":""},{"$f":"IF(Konfiguration!B140=\"\",\"\",Konfiguration!C140)","v":""},{"$f":"IF(Konfiguration!B140=\"\",\"\",Konfiguration!D140)","v":""}]
[null,{"$f":"IF(Konfiguration!B141=\"\",\"\",Konfiguration!B141)","v":""},{"$f":"IF(Konfiguration!B141=\"\",\"\",Konfiguration!C141)","v":""},{"$f":"IF(Konfiguration!B141=\"\",\"\",Konfiguration!D141)","v":""}]
[null,{"$f":"IF(Konfiguration!B142=\"\",\"\",Konfiguration!B142)","v":""},{"$f":"IF(Konfiguration!B142=\"\",\"\",Konfiguration!C142)","v":""},{"$f":"IF(Konfiguration!B142=\"\",\"\",Konfiguration!D142)","v":""}]
[null,{"$f":"IF(Konfiguration!B143=\"\",\"\",Konfiguration!B143)","v":""},{"$f":"IF(Konfiguration!B143=\"\",\"\",Konfiguration!C143)","v":""},{"$f":"IF(Konfiguration!B143=\"\",\"\",Konfiguration!D143)","v":""}]
[null,{"$f":"IF(Konfiguration!B144=\"\",\"\",Konfiguration!B144)","v":""},{"$f":"IF(Konfiguration!B144=\"\",\"\",Konfiguration!C144)","v":""},{"$f":"IF(Konfiguration!B144=\"\",\"\",Konfiguration!D144)","v":""}]
[null,{"$f":"IF(Konfiguration!B145=\"\",\"\",Konfiguration!B145)","v":""},{"$f":"IF(Konfiguration!B145=\"\",\"\",Konfiguration!C145)","v":""},{"$f":"IF(Konfiguration!B145=\"\",\"\",Konfiguration!D145)","v":""}]
[null,{"$f":"IF(Konfiguration!B146=\"\",\"\",Konfiguration!B146)","v":""},{"$f":"IF(Konfiguration!B146=\"\",\"\",Konfiguration!C146)","v":""},{"$f":"IF(Konfiguration!B146=\"\",\"\",Konfiguration!D146)","v":""}]
[null,{"$f":"IF(Konfiguration!B147=\"\",\"\",Konfiguration!B147)","v":""},{"$f":"IF(Konfiguration!B147=\"\",\"\",Konfiguration!C147)","v":""},{"$f":"IF(Konfiguration!B147=\"\",\"\",Konfiguration!D147)","v":""}]
[null,{"$f":"IF(Konfiguration!B148=\"\",\"\",Konfiguration!B148)","v":""},{"$f":"IF(Konfiguration!B148=\"\",\"\",Konfiguration!C148)","v":""},{"$f":"IF(Konfiguration!B148=\"\",\"\",Konfiguration!D148)","v":""}]
[null,{"$f":"IF(Konfiguration!B149=\"\",\"\",Konfiguration!B149)","v":""},{"$f":"IF(Konfiguration!B149=\"\",\"\",Konfiguration!C149)","v":""},{"$f":"IF(Konfiguration!B149=\"\",\"\",Konfiguration!D149)","v":""}]
[null,{"$f":"IF(Konfiguration!B150=\"\",\"\",Konfiguration!B150)","v":""},{"$f":"IF(Konfiguration!B150=\"\",\"\",Konfiguration!C150)","v":""},{"$f":"IF(Konfiguration!B150=\"\",\"\",Konfiguration!D150)","v":""}]
[null,{"$f":"IF(Konfiguration!B151=\"\",\"\",Konfiguration!B151)","v":""},{"$f":"IF(Konfiguration!B151=\"\",\"\",Konfiguration!C151)","v":""},{"$f":"IF(Konfiguration!B151=\"\",\"\",Konfiguration!D151)","v":""}]
[null,{"$f":"IF(Konfiguration!B152=\"\",\"\",Konfiguration!B152)","v":""},{"$f":"IF(Konfiguration!B152=\"\",\"\",Konfiguration!C152)","v":""},{"$f":"IF(Konfiguration!B152=\"\",\"\",Konfiguration!D152)","v":""}]
[null,{"$f":"IF(Konfiguration!B153=\"\",\"\",Konfiguration!B153)","v":""},{"$f":"IF(Konfiguration!B153=\"\",\"\",Konfiguration!C153)","v":""},{"$f":"IF(Konfiguration!B153=\"\",\"\",Konfiguration!D153)","v":""}]
[null,{"$f":"IF(Konfiguration!B154=\"\",\"\",Konfiguration!B154)","v":""},{"$f":"IF(Konfiguration!B154=\"\",\"\",Konfiguration!C154)","v":""},{"$f":"IF(Konfiguration!B154=\"\",\"\",Konfiguration!D154)","v":""}]
[null,{"$f":"IF(Konfiguration!B155=\"\",\"\",Konfiguration!B155)","v":""},{"$f":"IF(Konfiguration!B155=\"\",\"\",Konfiguration!C155)","v":""},{"$f":"IF(Konfiguration!B155=\"\",\"\",Konfiguration!D155)","v":""}]
[null,{"$f":"IF(Konfiguration!B156=\"\",\"\",Konfiguration!B156)","v":""},{"$f":"IF(Konfiguration!B156=\"\",\"\",Konfiguration!C156)","v":""},{"$f":"IF(Konfiguration!B156=\"\",\"\",Konfiguration!D156)","v":""}]
[null,{"$f":"IF(Konfiguration!B157=\"\",\"\",Konfiguration!B157)","v":""},{"$f":"IF(Konfiguration!B157=\"\",\"\",Konfiguration!C157)","v":""},{"$f":"IF(Konfiguration!B157=\"\",\"\",Konfiguration!D157)","v":""}]
[null,{"$f":"IF(Konfiguration!B158=\"\",\"\",Konfiguration!B158)","v":""},{"$f":"IF(Konfiguration!B158=\"\",\"\",Konfiguration!C158)","v":""},{"$f":"IF(Konfiguration!B158=\"\",\"\",Konfiguration!D158)","v":""}]
[null,{"$f":"IF(Konfiguration!B159=\"\",\"\",Konfiguration!B159)","v":""},{"$f":"IF(Konfiguration!B159=\"\",\"\",Konfiguration!C159)","v":""},{"$f":"IF(Konfiguration!B159=\"\",\"\",Konfiguration!D159)","v":""}]
[null,{"$f":"IF(Konfiguration!B160=\"\",\"\",Konfiguration!B160)","v":""},{"$f":"IF(Konfiguration!B160=\"\",\"\",Konfiguration!C160)","v":""},{"$f":"IF(Konfiguration!B160=\"\",\"\",Konfiguration!D160)","v":""}]
[null,{"$f":"IF(Konfiguration!B161=\"\",\"\",Konfiguration!B161)","v":""},{"$f":"IF(Konfiguration!B161=\"\",\"\",Konfiguration!C161)","v":""},{"$f":"IF(Konfiguration!B161=\"\",\"\",Konfiguration!D161)","v":""}]
[null,{"$f":"IF(Konfiguration!B162=\"\",\"\",Konfiguration!B162)","v":""},{"$f":"IF(Konfiguration!B162=\"\",\"\",Konfiguration!C162)","v":""},{"$f":"IF(Konfiguration!B162=\"\",\"\",Konfiguration!D162)","v":""}]
[null,{"$f":"IF(Konfiguration!B163=\"\",\"\",Konfiguration!B163)","v":""},{"$f":"IF(Konfiguration!B163=\"\",\"\",Konfiguration!C163)","v":""},{"$f":"IF(Konfiguration!B163=\"\",\"\",Konfiguration!D163)","v":""}]
[null,{"$f":"IF(Konfiguration!B164=\"\",\"\",Konfiguration!B164)","v":""},{"$f":"IF(Konfiguration!B164=\"\",\"\",Konfiguration!C164)","v":""},{"$f":"IF(Konfiguration!B164=\"\",\"\",Konfiguration!D164)","v":""}]
[null,{"$f":"IF(Konfiguration!B165=\"\",\"\",Konfiguration!B165)","v":""},{"$f":"IF(Konfiguration!B165=\"\",\"\",Konfiguration!C165)","v":""},{"$f":"IF(Konfiguration!B165=\"\",\"\",Konfiguration!D165)","v":""}]
[null,{"$f":"IF(Konfiguration!B166=\"\",\"\",Konfiguration!B166)","v":""},{"$f":"IF(Konfiguration!B166=\"\",\"\",Konfiguration!C166)","v":""},{"$f":"IF(Konfiguration!B166=\"\",\"\",Konfiguration!D166)","v":""}]
[null,{"$f":"IF(Konfiguration!B167=\"\",\"\",Konfiguration!B167)","v":""},{"$f":"IF(Konfiguration!B167=\"\",\"\",Konfiguration!C167)","v":""},{"$f":"IF(Konfiguration!B167=\"\",\"\",Konfiguration!D167)","v":""}]
[null,{"$f":"IF(Konfiguration!B168=\"\",\"\",Konfiguration!B168)","v":""},{"$f":"IF(Konfiguration!B168=\"\",\"\",Konfiguration!C168)","v":""},{"$f":"IF(Konfiguration!B168=\"\",\"\",Konfiguration!D168)","v":""}]
[null,{"$f":"IF(Konfiguration!B169=\"\",\"\",Konfiguration!B169)","v":""},{"$f":"IF(Konfiguration!B169=\"\",\"\",Konfiguration!C169)","v":""},{"$f":"IF(Konfiguration!B169=\"\",\"\",Konfiguration!D169)","v":""}]
[null,{"$f":"IF(Konfiguration!B170=\"\",\"\",Konfiguration!B170)","v":""},{"$f":"IF(Konfiguration!B170=\"\",\"\",Konfiguration!C170)","v":""},{"$f":"IF(Konfiguration!B170=\"\",\"\",Konfiguration!D170)","v":""}]
[null,{"$f":"IF(Konfiguration!B171=\"\",\"\",Konfiguration!B171)","v":""},{"$f":"IF(Konfiguration!B171=\"\",\"\",Konfiguration!C171)","v":""},{"$f":"IF(Konfiguration!B171=\"\",\"\",Konfiguration!D171)","v":""}]
[null,{"$f":"IF(Konfiguration!B172=\"\",\"\",Konfiguration!B172)","v":""},{"$f":"IF(Konfiguration!B172=\"\",\"\",Konfiguration!C172)","v":""},{"$f":"IF(Konfiguration!B172=\"\",\"\",Konfiguration!D172)","v":""}]
[null,{"$f":"IF(Konfiguration!B173=\"\",\"\",Konfiguration!B173)","v":""},{"$f":"IF(Konfiguration!B173=\"\",\"\",Konfiguration!C173)","v":""},{"$f":"IF(Konfiguration!B173=\"\",\"\",Konfiguration!D173)","v":""}]
[null,{"$f":"IF(Konfiguration!B174=\"\",\"\",Konfiguration!B174)","v":""},{"$f":"IF(Konfiguration!B174=\"\",\"\",Konfiguration!C174)","v":""},{"$f":"IF(Konfiguration!B174=\"\",\"\",Konfiguration!D174)","v":""}]
[null,{"$f":"IF(Konfiguration!B175=\"\",\"\",Konfiguration!B175)","v":""},{"$f":"IF(Konfiguration!B175=\"\",\"\",Konfiguration!C175)","v":""},{"$f":"IF(Konfiguration!B175=\"\",\"\",Konfiguration!D175)","v":""}]
[null,{"$f":"IF(Konfiguration!B176=\"\",\"\",Konfiguration!B176)","v":""},{"$f":"IF(Konfiguration!B176=\"\",\"\",Konfiguration!C176)","v":""},{"$f":"IF(Konfiguration!B176=\"\",\"\",Konfiguration!D176)","v":""}]
[null,{"$f":"IF(Konfiguration!B177=\"\",\"\",Konfiguration!B177)","v":""},{"$f":"IF(Konfiguration!B177=\"\",\"\",Konfiguration!C177)","v":""},{"$f":"IF(Konfiguration!B177=\"\",\"\",Konfiguration!D177)","v":""}]
[null,{"$f":"IF(Konfiguration!B178=\"\",\"\",Konfiguration!B178)","v":""},{"$f":"IF(Konfiguration!B178=\"\",\"\",Konfiguration!C178)","v":""},{"$f":"IF(Konfiguration!B178=\"\",\"\",Konfiguration!D178)","v":""}]
[null,{"$f":"IF(Konfiguration!B179=\"\",\"\",Konfiguration!B179)","v":""},{"$f":"IF(Konfiguration!B179=\"\",\"\",Konfiguration!C179)","v":""},{"$f":"IF(Konfiguration!B179=\"\",\"\",Konfiguration!D179)","v":""}]
[null,{"$f":"IF(Konfiguration!B180=\"\",\"\",Konfiguration!B180)","v":""},{"$f":"IF(Konfiguration!B180=\"\",\"\",Konfiguration!C180)","v":""},{"$f":"IF(Konfiguration!B180=\"\",\"\",Konfiguration!D180)","v":""}]
[null,{"$f":"IF(Konfiguration!B181=\"\",\"\",Konfiguration!B181)","v":""},{"$f":"IF(Konfiguration!B181=\"\",\"\",Konfiguration!C181)","v":""},{"$f":"IF(Konfiguration!B181=\"\",\"\",Konfiguration!D181)","v":""}]
[null,{"$f":"IF(Konfiguration!B182=\"\",\"\",Konfiguration!B182)","v":""},{"$f":"IF(Konfiguration!B182=\"\",\"\",Konfiguration!C182)","v":""},{"$f":"IF(Konfiguration!B182=\"\",\"\",Konfiguration!D182)","v":""}]
[null,{"$f":"IF(Konfiguration!B183=\"\",\"\",Konfiguration!B183)","v":""},{"$f":"IF(Konfiguration!B183=\"\",\"\",Konfiguration!C183)","v":""},{"$f":"IF(Konfiguration!B183=\"\",\"\",Konfiguration!D183)","v":""}]
[null,{"$f":"IF(Konfiguration!B184=\"\",\"\",Konfiguration!B184)","v":""},{"$f":"IF(Konfiguration!B184=\"\",\"\",Konfiguration!C184)","v":""},{"$f":"IF(Konfiguration!B184=\"\",\"\",Konfiguration!D184)","v":""}]
[null,{"$f":"IF(Konfiguration!B185=\"\",\"\",Konfiguration!B185)","v":""},{"$f":"IF(Konfiguration!B185=\"\",\"\",Konfiguration!C185)","v":""},{"$f":"IF(Konfiguration!B185=\"\",\"\",Konfiguration!D185)","v":""}]
[null,{"$f":"IF(Konfiguration!B186=\"\",\"\",Konfiguration!B186)","v":""},{"$f":"IF(Konfiguration!B186=\"\",\"\",Konfiguration!C186)","v":""},{"$f":"IF(Konfiguration!B186=\"\",\"\",Konfiguration!D186)","v":""}]
[null,{"$f":"IF(Konfiguration!B187=\"\",\"\",Konfiguration!B187)","v":""},{"$f":"IF(Konfiguration!B187=\"\",\"\",Konfiguration!C187)","v":""},{"$f":"IF(Konfiguration!B187=\"\",\"\",Konfiguration!D187)","v":""}]
[null,{"$f":"IF(Konfiguration!B188=\"\",\"\",Konfiguration!B188)","v":""},{"$f":"IF(Konfiguration!B188=\"\",\"\",Konfiguration!C188)","v":""},{"$f":"IF(Konfiguration!B188=\"\",\"\",Konfiguration!D188)","v":""}]
[null,{"$f":"IF(Konfiguration!B189=\"\",\"\",Konfiguration!B189)","v":""},{"$f":"IF(Konfiguration!B189=\"\",\"\",Konfiguration!C189)","v":""},{"$f":"IF(Konfiguration!B189=\"\",\"\",Konfiguration!D189)","v":""}]
[null,{"$f":"IF(Konfiguration!B190=\"\",\"\",Konfiguration!B190)","v":""},{"$f":"IF(Konfiguration!B190=\"\",\"\",Konfiguration!C190)","v":""},{"$f":"IF(Konfiguration!B190=\"\",\"\",Konfiguration!D190)","v":""}]
[null,{"$f":"IF(Konfiguration!B191=\"\",\"\",Konfiguration!B191)","v":""},{"$f":"IF(Konfiguration!B191=\"\",\"\",Konfiguration!C191)","v":""},{"$f":"IF(Konfiguration!B191=\"\",\"\",Konfiguration!D191)","v":""}]
[null,{"$f":"IF(Konfiguration!B192=\"\",\"\",Konfiguration!B192)","v":""},{"$f":"IF(Konfiguration!B192=\"\",\"\",Konfiguration!C192)","v":""},{"$f":"IF(Konfiguration!B192=\"\",\"\",Konfiguration!D192)","v":""}]
[null,{"$f":"IF(Konfiguration!B193=\"\",\"\",Konfiguration!B193)","v":""},{"$f":"IF(Konfiguration!B193=\"\",\"\",Konfiguration!C193)","v":""},{"$f":"IF(Konfiguration!B193=\"\",\"\",Konfiguration!D193)","v":""}]
[null,{"$f":"IF(Konfiguration!B194=\"\",\"\",Konfiguration!B194)","v":""},{"$f":"IF(Konfiguration!B194=\"\",\"\",Konfiguration!C194)","v":""},{"$f":"IF(Konfiguration!B194=\"\",\"\",Konfiguration!D194)","v":""}]
[null,{"$f":"IF(Konfiguration!B195=\"\",\"\",Konfiguration!B195)","v":""},{"$f":"IF(Konfiguration!B195=\"\",\"\",Konfiguration!C195)","v":""},{"$f":"IF(Konfiguration!B195=\"\",\"\",Konfiguration!D195)","v":""}]
[null,{"$f":"IF(Konfiguration!B196=\"\",\"\",Konfiguration!B196)","v":""},{"$f":"IF(Konfiguration!B196=\"\",\"\",Konfiguration!C196)","v":""},{"$f":"IF(Konfiguration!B196=\"\",\"\",Konfiguration!D196)","v":""}]
[null,{"$f":"IF(Konfiguration!B197=\"\",\"\",Konfiguration!B197)","v":""},{"$f":"IF(Konfiguration!B197=\"\",\"\",Konfiguration!C197)","v":""},{"$f":"IF(Konfiguration!B197=\"\",\"\",Konfiguration!D197)","v":""}]
[null,{"$f":"IF(Konfiguration!B198=\"\",\"\",Konfiguration!B198)","v":""},{"$f":"IF(Konfiguration!B198=\"\",\"\",Konfiguration!C198)","v":""},{"$f":"IF(Konfiguration!B198=\"\",\"\",Konfiguration!D198)","v":""}]
[null,{"$f":"IF(Konfiguration!B199=\"\",\"\",Konfiguration!B199)","v":""},{"$f":"IF(Konfiguration!B199=\"\",\"\",Konfiguration!C199)","v":""},{"$f":"IF(Konfiguration!B199=\"\",\"\",Konfiguration!D199)","v":""}]
[null,{"$f":"IF(Konfiguration!B200=\"\",\"\",Konfiguration!B200)","v":""},{"$f":"IF(Konfiguration!B200=\"\",\"\",Konfiguration!C200)","v":""},{"$f":"IF(Konfiguration!B200=\"\",\"\",Konfiguration!D200)","v":""}]
[null,{"$f":"IF(Konfiguration!B201=\"\",\"\",Konfiguration!B201)","v":""},{"$f":"IF(Konfiguration!B201=\"\",\"\",Konfiguration!C201)","v":""},{"$f":"IF(Konfiguration!B201=\"\",\"\",Konfiguration!D201)","v":""}]
[null,{"$f":"IF(Konfiguration!B202=\"\",\"\",Konfiguration!B202)","v":""},{"$f":"IF(Konfiguration!B202=\"\",\"\",Konfiguration!C202)","v":""},{"$f":"IF(Konfiguration!B202=\"\",\"\",Konfiguration!D202)","v":""}]
[null,{"$f":"IF(Konfiguration!B203=\"\",\"\",Konfiguration!B203)","v":""},{"$f":"IF(Konfiguration!B203=\"\",\"\",Konfiguration!C203)","v":""},{"$f":"IF(Konfiguration!B203=\"\",\"\",Konfiguration!D203)","v":""}]
[null,{"$f":"IF(Konfiguration!B204=\"\",\"\",Konfiguration!B204)","v":""},{"$f":"IF(Konfiguration!B204=\"\",\"\",Konfiguration!C204)","v":""},{"$f":"IF(Konfiguration!B204=\"\",\"\",Konfiguration!D204)","v":""}]
[null,{"$f":"IF(Konfiguration!B205=\"\",\"\",Konfiguration!B205)","v":""},{"$f":"IF(Konfiguration!B205=\"\",\"\",Konfiguration!C205)","v":""},{"$f":"IF(Konfiguration!B205=\"\",\"\",Konfiguration!D205)","v":""}]
[null,{"$f":"IF(Konfiguration!B206=\"\",\"\",Konfiguration!B206)","v":""},{"$f":"IF(Konfiguration!B206=\"\",\"\",Konfiguration!C206)","v":""},{"$f":"IF(Konfiguration!B206=\"\",\"\",Konfiguration!D206)","v":""}]
[null,{"$f":"IF(Konfiguration!B207=\"\",\"\",Konfiguration!B207)","v":""},{"$f":"IF(Konfiguration!B207=\"\",\"\",Konfiguration!C207)","v":""},{"$f":"IF(Konfiguration!B207=\"\",\"\",Konfiguration!D207)","v":""}]
[null,{"$f":"IF(Konfiguration!B208=\"\",\"\",Konfiguration!B208)","v":""},{"$f":"IF(Konfiguration!B208=\"\",\"\",Konfiguration!C208)","v":""},{"$f":"IF(Konfiguration!B208=\"\",\"\",Konfiguration!D208)","v":""}]
[null,{"$f":"IF(Konfiguration!B209=\"\",\"\",Konfiguration!B209)","v":""},{"$f":"IF(Konfiguration!B209=\"\",\"\",Konfiguration!C209)","v":""},{"$f":"IF(Konfiguration!B209=\"\",\"\",Konfiguration!D209)","v":""}]
[null,{"$f":"IF(Konfiguration!B210=\"\",\"\",Konfiguration!B210)","v":""},{"$f":"IF(Konfiguration!B210=\"\",\"\",Konfiguration!C210)","v":""},{"$f":"IF(Konfiguration!B210=\"\",\"\",Konfiguration!D210)","v":""}]
[null,{"$f":"IF(Konfiguration!B211=\"\",\"\",Konfiguration!B211)","v":""},{"$f":"IF(Konfiguration!B211=\"\",\"\",Konfiguration!C211)","v":""},{"$f":"IF(Konfiguration!B211=\"\",\"\",Konfiguration!D211)","v":""}]
[null,{"$f":"IF(Konfiguration!B212=\"\",\"\",Konfiguration!B212)","v":""},{"$f":"IF(Konfiguration!B212=\"\",\"\",Konfiguration!C212)","v":""},{"$f":"IF(Konfiguration!B212=\"\",\"\",Konfiguration!D212)","v":""}]
[null,{"$f":"IF(Konfiguration!B213=\"\",\"\",Konfiguration!B213)","v":""},{"$f":"IF(Konfiguration!B213=\"\",\"\",Konfiguration!C213)","v":""},{"$f":"IF(Konfiguration!B213=\"\",\"\",Konfiguration!D213)","v":""}]
[null,{"$f":"IF(Konfiguration!B214=\"\",\"\",Konfiguration!B214)","v":""},{"$f":"IF(Konfiguration!B214=\"\",\"\",Konfiguration!C214)","v":""},{"$f":"IF(Konfiguration!B214=\"\",\"\",Konfiguration!D214)","v":""}]
[null,{"$f":"IF(Konfiguration!B215=\"\",\"\",Konfiguration!B215)","v":""},{"$f":"IF(Konfiguration!B215=\"\",\"\",Konfiguration!C215)","v":""},{"$f":"IF(Konfiguration!B215=\"\",\"\",Konfiguration!D215)","v":""}]
[null,{"$f":"IF(Konfiguration!B216=\"\",\"\",Konfiguration!B216)","v":""},{"$f":"IF(Konfiguration!B216=\"\",\"\",Konfiguration!C216)","v":""},{"$f":"IF(Konfiguration!B216=\"\",\"\",Konfiguration!D216)","v":""}]
[null,{"$f":"IF(Konfiguration!B217=\"\",\"\",Konfiguration!B217)","v":""},{"$f":"IF(Konfiguration!B217=\"\",\"\",Konfiguration!C217)","v":""},{"$f":"IF(Konfiguration!B217=\"\",\"\",Konfiguration!D217)","v":""}]
[null,{"$f":"IF(Konfiguration!B218=\"\",\"\",Konfiguration!B218)","v":""},{"$f":"IF(Konfiguration!B218=\"\",\"\",Konfiguration!C218)","v":""},{"$f":"IF(Konfiguration!B218=\"\",\"\",Konfiguration!D218)","v":""}]
[null,{"$f":"IF(Konfiguration!B219=\"\",\"\",Konfiguration!B219)","v":""},{"$f":"IF(Konfiguration!B219=\"\",\"\",Konfiguration!C219)","v":""},{"$f":"IF(Konfiguration!B219=\"\",\"\",Konfiguration!D219)","v":""}]
[null,{"$f":"IF(Konfiguration!B220=\"\",\"\",Konfiguration!B220)","v":""},{"$f":"IF(Konfiguration!B220=\"\",\"\",Konfiguration!C220)","v":""},{"$f":"IF(Konfiguration!B220=\"\",\"\",Konfiguration!D220)","v":""}]
[null,{"$f":"IF(Konfiguration!B221=\"\",\"\",Konfiguration!B221)","v":""},{"$f":"IF(Konfiguration!B221=\"\",\"\",Konfiguration!C221)","v":""},{"$f":"IF(Konfiguration!B221=\"\",\"\",Konfiguration!D221)","v":""}]
[null,{"$f":"IF(Konfiguration!B222=\"\",\"\",Konfiguration!B222)","v":""},{"$f":"IF(Konfiguration!B222=\"\",\"\",Konfiguration!C222)","v":""},{"$f":"IF(Konfiguration!B222=\"\",\"\",Konfiguration!D222)","v":""}]
[null,{"$f":"IF(Konfiguration!B223=\"\",\"\",Konfiguration!B223)","v":""},{"$f":"IF(Konfiguration!B223=\"\",\"\",Konfiguration!C223)","v":""},{"$f":"IF(Konfiguration!B223=\"\",\"\",Konfiguration!D223)","v":""}]
[null,{"$f":"IF(Konfiguration!B224=\"\",\"\",Konfiguration!B224)","v":""},{"$f":"IF(Konfiguration!B224=\"\",\"\",Konfiguration!C224)","v":""},{"$f":"IF(Konfiguration!B224=\"\",\"\",Konfiguration!D224)","v":""}]
[null,{"$f":"IF(Konfiguration!B225=\"\",\"\",Konfiguration!B225)","v":""},{"$f":"IF(Konfiguration!B225=\"\",\"\",Konfiguration!C225)","v":""},{"$f":"IF(Konfiguration!B225=\"\",\"\",Konfiguration!D225)","v":""}]
[null,{"$f":"IF(Konfiguration!B226=\"\",\"\",Konfiguration!B226)","v":""},{"$f":"IF(Konfiguration!B226=\"\",\"\",Konfiguration!C226)","v":""},{"$f":"IF(Konfiguration!B226=\"\",\"\",Konfiguration!D226)","v":""}]
[null,{"$f":"IF(Konfiguration!B227=\"\",\"\",Konfiguration!B227)","v":""},{"$f":"IF(Konfiguration!B227=\"\",\"\",Konfiguration!C227)","v":""},{"$f":"IF(Konfiguration!B227=\"\",\"\",Konfiguration!D227)","v":""}]
[null,{"$f":"IF(Konfiguration!B228=\"\",\"\",Konfiguration!B228)","v":""},{"$f":"IF(Konfiguration!B228=\"\",\"\",Konfiguration!C228)","v":""},{"$f":"IF(Konfiguration!B228=\"\",\"\",Konfiguration!D228)","v":""}]
[null,{"$f":"IF(Konfiguration!B229=\"\",\"\",Konfiguration!B229)","v":""},{"$f":"IF(Konfiguration!B229=\"\",\"\",Konfiguration!C229)","v":""},{"$f":"IF(Konfiguration!B229=\"\",\"\",Konfiguration!D229)","v":""}]
[null,{"$f":"IF(Konfiguration!B230=\"\",\"\",Konfiguration!B230)","v":""},{"$f":"IF(Konfiguration!B230=\"\",\"\",Konfiguration!C230)","v":""},{"$f":"IF(Konfiguration!B230=\"\",\"\",Konfiguration!D230)","v":""}]
[null,{"$f":"IF(Konfiguration!B231=\"\",\"\",Konfiguration!B231)","v":""},{"$f":"IF(Konfiguration!B231=\"\",\"\",Konfiguration!C231)","v":""},{"$f":"IF(Konfiguration!B231=\"\",\"\",Konfiguration!D231)","v":""}]
[null,{"$f":"IF(Konfiguration!B232=\"\",\"\",Konfiguration!B232)","v":""},{"$f":"IF(Konfiguration!B232=\"\",\"\",Konfiguration!C232)","v":""},{"$f":"IF(Konfiguration!B232=\"\",\"\",Konfiguration!D232)","v":""}]
[null,{"$f":"IF(Konfiguration!B233=\"\",\"\",Konfiguration!B233)","v":""},{"$f":"IF(Konfiguration!B233=\"\",\"\",Konfiguration!C233)","v":""},{"$f":"IF(Konfiguration!B233=\"\",\"\",Konfiguration!D233)","v":""}]
[null,{"$f":"IF(Konfiguration!B234=\"\",\"\",Konfiguration!B234)","v":""},{"$f":"IF(Konfiguration!B234=\"\",\"\",Konfiguration!C234)","v":""},{"$f":"IF(Konfiguration!B234=\"\",\"\",Konfiguration!D234)","v":""}]
[null,{"$f":"IF(Konfiguration!B235=\"\",\"\",Konfiguration!B235)","v":""},{"$f":"IF(Konfiguration!B235=\"\",\"\",Konfiguration!C235)","v":""},{"$f":"IF(Konfiguration!B235=\"\",\"\",Konfiguration!D235)","v":""}]
[null,{"$f":"IF(Konfiguration!B236=\"\",\"\",Konfiguration!B236)","v":""},{"$f":"IF(Konfiguration!B236=\"\",\"\",Konfiguration!C236)","v":""},{"$f":"IF(Konfiguration!B236=\"\",\"\",Konfiguration!D236)","v":""}]
[null,{"$f":"IF(Konfiguration!B237=\"\",\"\",Konfiguration!B237)","v":""},{"$f":"IF(Konfiguration!B237=\"\",\"\",Konfiguration!C237)","v":""},{"$f":"IF(Konfiguration!B237=\"\",\"\",Konfiguration!D237)","v":""}]
[null,{"$f":"IF(Konfiguration!B238=\"\",\"\",Konfiguration!B238)","v":""},{"$f":"IF(Konfiguration!B238=\"\",\"\",Konfiguration!C238)","v":""},{"$f":"IF(Konfiguration!B238=\"\",\"\",Konfiguration!D238)","v":""}]
[null,{"$f":"IF(Konfiguration!B239=\"\",\"\",Konfiguration!B239)","v":""},{"$f":"IF(Konfiguration!B239=\"\",\"\",Konfiguration!C239)","v":""},{"$f":"IF(Konfiguration!B239=\"\",\"\",Konfiguration!D239)","v":""}]
[null,{"$f":"IF(Konfiguration!B240=\"\",\"\",Konfiguration!B240)","v":""},{"$f":"IF(Konfiguration!B240=\"\",\"\",Konfiguration!C240)","v":""},{"$f":"IF(Konfiguration!B240=\"\",\"\",Konfiguration!D240)","v":""}]
[null,{"$f":"IF(Konfiguration!B241=\"\",\"\",Konfiguration!B241)","v":""},{"$f":"IF(Konfiguration!B241=\"\",\"\",Konfiguration!C241)","v":""},{"$f":"IF(Konfiguration!B241=\"\",\"\",Konfiguration!D241)","v":""}]
[null,{"$f":"IF(Konfiguration!B242=\"\",\"\",Konfiguration!B242)","v":""},{"$f":"IF(Konfiguration!B242=\"\",\"\",Konfiguration!C242)","v":""},{"$f":"IF(Konfiguration!B242=\"\",\"\",Konfiguration!D242)","v":""}]
[null,{"$f":"IF(Konfiguration!B243=\"\",\"\",Konfiguration!B243)","v":""},{"$f":"IF(Konfiguration!B243=\"\",\"\",Konfiguration!C243)","v":""},{"$f":"IF(Konfiguration!B243=\"\",\"\",Konfiguration!D243)","v":""}]
[null,{"$f":"IF(Konfiguration!B244=\"\",\"\",Konfiguration!B244)","v":""},{"$f":"IF(Konfiguration!B244=\"\",\"\",Konfiguration!C244)","v":""},{"$f":"IF(Konfiguration!B244=\"\",\"\",Konfiguration!D244)","v":""}]
[null,{"$f":"IF(Konfiguration!B245=\"\",\"\",Konfiguration!B245)","v":""},{"$f":"IF(Konfiguration!B245=\"\",\"\",Konfiguration!C245)","v":""},{"$f":"IF(Konfiguration!B245=\"\",\"\",Konfiguration!D245)","v":""}]
[null,{"$f":"IF(Konfiguration!B246=\"\",\"\",Konfiguration!B246)","v":""},{"$f":"IF(Konfiguration!B246=\"\",\"\",Konfiguration!C246)","v":""},{"$f":"IF(Konfiguration!B246=\"\",\"\",Konfiguration!D246)","v":""}]
[null,{"$f":"IF(Konfiguration!B247=\"\",\"\",Konfiguration!B247)","v":""},{"$f":"IF(Konfiguration!B247=\"\",\"\",Konfiguration!C247)","v":""},{"$f":"IF(Konfiguration!B247=\"\",\"\",Konfiguration!D247)","v":""}]
[null,{"$f":"IF(Konfiguration!B248=\"\",\"\",Konfiguration!B248)","v":""},{"$f":"IF(Konfiguration!B248=\"\",\"\",Konfiguration!C248)","v":""},{"$f":"IF(Konfiguration!B248=\"\",\"\",Konfiguration!D248)","v":""}]
[null,{"$f":"IF(Konfiguration!B249=\"\",\"\",Konfiguration!B249)","v":""},{"$f":"IF(Konfiguration!B249=\"\",\"\",Konfiguration!C249)","v":""},{"$f":"IF(Konfiguration!B249=\"\",\"\",Konfiguration!D249)","v":""}]
[null,{"$f":"IF(Konfiguration!B250=\"\",\"\",Konfiguration!B250)","v":""},{"$f":"IF(Konfiguration!B250=\"\",\"\",Konfiguration!C250)","v":""},{"$f":"IF(Konfiguration!B250=\"\",\"\",Konfiguration!D250)","v":""}]
[null,{"$f":"IF(Konfiguration!B251=\"\",\"\",Konfiguration!B251)","v":""},{"$f":"IF(Konfiguration!B252=\"\",\"\",Konfiguration!C252)","v":""},{"$f":"IF(Konfiguration!B251=\"\",\"\",Konfiguration!D251)","v":""}]
[null,{"$f":"IF(Konfiguration!B252=\"\",\"\",Konfiguration!B252)","v":""},{"$f":"IF(Konfiguration!B253=\"\",\"\",Konfiguration!C253)","v":""},{"$f":"IF(Konfiguration!B252=\"\",\"\",Konfiguration!D252)","v":""}]
[null,{"$f":"IF(Konfiguration!B253=\"\",\"\",Konfiguration!B253)","v":""},{"$f":"IF(Konfiguration!B254=\"\",\"\",Konfiguration!C254)","v":""},{"$f":"IF(Konfiguration!B253=\"\",\"\",Konfiguration!D253)","v":""}]
[null,{"$f":"IF(Konfiguration!B254=\"\",\"\",Konfiguration!B254)","v":""},{"$f":"IF(Konfiguration!B255=\"\",\"\",Konfiguration!C255)","v":""},{"$f":"IF(Konfiguration!B254=\"\",\"\",Konfiguration!D254)","v":""}]
[null,{"$f":"IF(Konfiguration!B255=\"\",\"\",Konfiguration!B255)","v":""},{"$f":"IF(Konfiguration!B256=\"\",\"\",Konfiguration!C256)","v":""},{"$f":"IF(Konfiguration!B255=\"\",\"\",Konfiguration!D255)","v":""}]
[null,{"$f":"IF(Konfiguration!B256=\"\",\"\",Konfiguration!B256)","v":""},{"$f":"IF(Konfiguration!B257=\"\",\"\",Konfiguration!C257)","v":""},{"$f":"IF(Konfiguration!B256=\"\",\"\",Konfiguration!D256)","v":""}]
[null,{"$f":"IF(Konfiguration!B257=\"\",\"\",Konfiguration!B257)","v":""},{"$f":"IF(Konfiguration!B258=\"\",\"\",Konfiguration!C258)","v":""},{"$f":"IF(Konfiguration!B257=\"\",\"\",Konfiguration!D257)","v":""}]
[null,{"$f":"IF(Konfiguration!B258=\"\",\"\",Konfiguration!B258)","v":""},{"$f":"IF(Konfiguration!B259=\"\",\"\",Konfiguration!C259)","v":""},{"$f":"IF(Konfiguration!B258=\"\",\"\",Konfiguration!D258)","v":""}]
[null,{"$f":"IF(Konfiguration!B259=\"\",\"\",Konfiguration!B259)","v":""},{"$f":"IF(Konfiguration!B260=\"\",\"\",Konfiguration!C260)","v":""},{"$f":"IF(Konfiguration!B259=\"\",\"\",Konfiguration!D259)","v":""}]
[null,{"$f":"IF(Konfiguration!B260=\"\",\"\",Konfiguration!B260)","v":""},{"$f":"IF(Konfiguration!B261=\"\",\"\",Konfiguration!C261)","v":""},{"$f":"IF(Konfiguration!B260=\"\",\"\",Konfiguration!D260)","v":""}]
[null,{"$f":"IF(Konfiguration!B261=\"\",\"\",Konfiguration!B261)","v":""},{"$f":"IF(Konfiguration!B262=\"\",\"\",Konfiguration!C262)","v":""},{"$f":"IF(Konfiguration!B261=\"\",\"\",Konfiguration!D261)","v":""}]
[null,{"$f":"IF(Konfiguration!B262=\"\",\"\",Konfiguration!B262)","v":""},{"$f":"IF(Konfiguration!B263=\"\",\"\",Konfiguration!C263)","v":""},{"$f":"IF(Konfiguration!B262=\"\",\"\",Konfiguration!D262)","v":""}]
[null,{"$f":"IF(Konfiguration!B263=\"\",\"\",Konfiguration!B263)","v":""},{"$f":"IF(Konfiguration!B264=\"\",\"\",Konfiguration!C264)","v":""},{"$f":"IF(Konfiguration!B263=\"\",\"\",Konfiguration!D263)","v":""}]
[null,{"$f":"IF(Konfiguration!B264=\"\",\"\",Konfiguration!B264)","v":""},{"$f":"IF(Konfiguration!B265=\"\",\"\",Konfiguration!C265)","v":""},{"$f":"IF(Konfiguration!B264=\"\",\"\",Konfiguration!D264)","v":""}]
[null,{"$f":"IF(Konfiguration!B265=\"\",\"\",Konfiguration!B265)","v":""},{"$f":"IF(Konfiguration!B266=\"\",\"\",Konfiguration!C266)","v":""},{"$f":"IF(Konfiguration!B265=\"\",\"\",Konfiguration!D265)","v":""}]
[null,{"$f":"IF(Konfiguration!B266=\"\",\"\",Konfiguration!B266)","v":""},{"$f":"IF(Konfiguration!B267=\"\",\"\",Konfiguration!C267)","v":""},{"$f":"IF(Konfiguration!B266=\"\",\"\",Konfiguration!D266)","v":""}]
[null,{"$f":"IF(Konfiguration!B267=\"\",\"\",Konfiguration!B267)","v":""},{"$f":"IF(Konfiguration!B268=\"\",\"\",Konfiguration!C268)","v":""},{"$f":"IF(Konfiguration!B267=\"\",\"\",Konfiguration!D267)","v":""}]
[null,{"$f":"IF(Konfiguration!B268=\"\",\"\",Konfiguration!B268)","v":""},{"$f":"IF(Konfiguration!B269=\"\",\"\",Konfiguration!C269)","v":""},{"$f":"IF(Konfiguration!B268=\"\",\"\",Konfiguration!D268)","v":""}]
[null,{"$f":"IF(Konfiguration!B269=\"\",\"\",Konfiguration!B269)","v":""},{"$f":"IF(Konfiguration!B270=\"\",\"\",Konfiguration!C270)","v":""},{"$f":"IF(Konfiguration!B269=\"\",\"\",Konfiguration!D269)","v":""}]
[null,{"$f":"IF(Konfiguration!B270=\"\",\"\",Konfiguration!B270)","v":""},{"$f":"IF(Konfiguration!B271=\"\",\"\",Konfiguration!C271)","v":""},{"$f":"IF(Konfiguration!B270=\"\",\"\",Konfiguration!D270)","v":""}]
[null,{"$f":"IF(Konfiguration!B271=\"\",\"\",Konfiguration!B271)","v":""},{"$f":"IF(Konfiguration!B272=\"\",\"\",Konfiguration!C272)","v":""},{"$f":"IF(Konfiguration!B271=\"\",\"\",Konfiguration!D271)","v":""}]
[null,{"$f":"IF(Konfiguration!B272=\"\",\"\",Konfiguration!B272)","v":""},{"$f":"IF(Konfiguration!B273=\"\",\"\",Konfiguration!C273)","v":""},{"$f":"IF(Konfiguration!B272=\"\",\"\",Konfiguration!D272)","v":""}]
[null,{"$f":"IF(Konfiguration!B273=\"\",\"\",Konfiguration!B273)","v":""},{"$f":"IF(Konfiguration!B274=\"\",\"\",Konfiguration!C274)","v":""},{"$f":"IF(Konfiguration!B273=\"\",\"\",Konfiguration!D273)","v":""}]
[null,{"$f":"IF(Konfiguration!B274=\"\",\"\",Konfiguration!B274)","v":""},{"$f":"IF(Konfiguration!B275=\"\",\"\",Konfiguration!C275)","v":""},{"$f":"IF(Konfiguration!B274=\"\",\"\",Konfiguration!D274)","v":""}]
[null,{"$f":"IF(Konfiguration!B275=\"\",\"\",Konfiguration!B275)","v":""},{"$f":"IF(Konfiguration!B276=\"\",\"\",Konfiguration!C276)","v":""},{"$f":"IF(Konfiguration!B275=\"\",\"\",Konfiguration!D275)","v":""}]
[null,{"$f":"IF(Konfiguration!B276=\"\",\"\",Konfiguration!B276)","v":""},{"$f":"IF(Konfiguration!B277=\"\",\"\",Konfiguration!C277)","v":""},{"$f":"IF(Konfiguration!B276=\"\",\"\",Konfiguration!D276)","v":""}]
[null,{"$f":"IF(Konfiguration!B277=\"\",\"\",Konfiguration!B277)","v":""},{"$f":"IF(Konfiguration!B278=\"\",\"\",Konfiguration!C278)","v":""},{"$f":"IF(Konfiguration!B277=\"\",\"\",Konfiguration!D277)","v":""}]
[null,{"$f":"IF(Konfiguration!B278=\"\",\"\",Konfiguration!B278)","v":""},{"$f":"IF(Konfiguration!B279=\"\",\"\",Konfiguration!C279)","v":""},{"$f":"IF(Konfiguration!B278=\"\",\"\",Konfiguration!D278)","v":""}]
[null,{"$f":"IF(Konfiguration!B279=\"\",\"\",Konfiguration!B279)","v":""},{"$f":"IF(Konfiguration!B280=\"\",\"\",Konfiguration!C280)","v":""},{"$f":"IF(Konfiguration!B279=\"\",\"\",Konfiguration!D279)","v":""}]
[null,{"$f":"IF(Konfiguration!B280=\"\",\"\",Konfiguration!B280)","v":""},{"$f":"IF(Konfiguration!B281=\"\",\"\",Konfiguration!C281)","v":""},{"$f":"IF(Konfiguration!B280=\"\",\"\",Konfiguration!D280)","v":""}]
[null,{"$f":"IF(Konfiguration!B281=\"\",\"\",Konfiguration!B281)","v":""},{"$f":"IF(Konfiguration!B282=\"\",\"\",Konfiguration!C282)","v":""},{"$f":"IF(Konfiguration!B281=\"\",\"\",Konfiguration!D281)","v":""}]
[null,{"$f":"IF(Konfiguration!B282=\"\",\"\",Konfiguration!B282)","v":""},{"$f":"IF(Konfiguration!B283=\"\",\"\",Konfiguration!C283)","v":""},{"$f":"IF(Konfiguration!B282=\"\",\"\",Konfiguration!D282)","v":""}]
[null,{"$f":"IF(Konfiguration!B283=\"\",\"\",Konfiguration!B283)","v":""},{"$f":"IF(Konfiguration!B284=\"\",\"\",Konfiguration!C284)","v":""},{"$f":"IF(Konfiguration!B283=\"\",\"\",Konfiguration!D283)","v":""}]
[null,{"$f":"IF(Konfiguration!B284=\"\",\"\",Konfiguration!B284)","v":""},{"$f":"IF(Konfiguration!B285=\"\",\"\",Konfiguration!C285)","v":""},{"$f":"IF(Konfiguration!B284=\"\",\"\",Konfiguration!D284)","v":""}]
[null,{"$f":"IF(Konfiguration!B285=\"\",\"\",Konfiguration!B285)","v":""},{"$f":"IF(Konfiguration!B286=\"\",\"\",Konfiguration!C286)","v":""},{"$f":"IF(Konfiguration!B285=\"\",\"\",Konfiguration!D285)","v":""}]
[null,{"$f":"IF(Konfiguration!B286=\"\",\"\",Konfiguration!B286)","v":""},{"$f":"IF(Konfiguration!B287=\"\",\"\",Konfiguration!C287)","v":""},{"$f":"IF(Konfiguration!B286=\"\",\"\",Konfiguration!D286)","v":""}]
[null,{"$f":"IF(Konfiguration!B287=\"\",\"\",Konfiguration!B287)","v":""},{"$f":"IF(Konfiguration!B288=\"\",\"\",Konfiguration!C288)","v":""},{"$f":"IF(Konfiguration!B287=\"\",\"\",Konfiguration!D287)","v":""}]
[null,{"$f":"IF(Konfiguration!B288=\"\",\"\",Konfiguration!B288)","v":""},{"$f":"IF(Konfiguration!B289=\"\",\"\",Konfiguration!C289)","v":""},{"$f":"IF(Konfiguration!B288=\"\",\"\",Konfiguration!D288)","v":""}]
[null,{"$f":"IF(Konfiguration!B289=\"\",\"\",Konfiguration!B289)","v":""},{"$f":"IF(Konfiguration!B290=\"\",\"\",Konfiguration!C290)","v":""},{"$f":"IF(Konfiguration!B289=\"\",\"\",Konfiguration!D289)","v":""}]
[null,{"$f":"IF(Konfiguration!B290=\"\",\"\",Konfiguration!B290)","v":""},{"$f":"IF(Konfiguration!B291=\"\",\"\",Konfiguration!C291)","v":""},{"$f":"IF(Konfiguration!B290=\"\",\"\",Konfiguration!D290)","v":""}]
[null,{"$f":"IF(Konfiguration!B291=\"\",\"\",Konfiguration!B291)","v":""},{"$f":"IF(Konfiguration!B292=\"\",\"\",Konfiguration!C292)","v":""},{"$f":"IF(Konfiguration!B291=\"\",\"\",Konfiguration!D291)","v":""}]
[null,{"$f":"IF(Konfiguration!B292=\"\",\"\",Konfiguration!B292)","v":""},{"$f":"IF(Konfiguration!B293=\"\",\"\",Konfiguration!C293)","v":""},{"$f":"IF(Konfiguration!B292=\"\",\"\",Konfiguration!D292)","v":""}]
[null,{"$f":"IF(Konfiguration!B293=\"\",\"\",Konfiguration!B293)","v":""},{"$f":"IF(Konfiguration!B294=\"\",\"\",Konfiguration!C294)","v":""},{"$f":"IF(Konfiguration!B293=\"\",\"\",Konfiguration!D293)","v":""}]
[null,{"$f":"IF(Konfiguration!B294=\"\",\"\",Konfiguration!B294)","v":""},{"$f":"IF(Konfiguration!B295=\"\",\"\",Konfiguration!C295)","v":""},{"$f":"IF(Konfiguration!B294=\"\",\"\",Konfiguration!D294)","v":""}]
[null,{"$f":"IF(Konfiguration!B295=\"\",\"\",Konfiguration!B295)","v":""},{"$f":"IF(Konfiguration!B296=\"\",\"\",Konfiguration!C296)","v":""},{"$f":"IF(Konfiguration!B295=\"\",\"\",Konfiguration!D295)","v":""}]
[null,{"$f":"IF(Konfiguration!B296=\"\",\"\",Konfiguration!B296)","v":""},{"$f":"IF(Konfiguration!B297=\"\",\"\",Konfiguration!C297)","v":""},{"$f":"IF(Konfiguration!B296=\"\",\"\",Konfiguration!D296)","v":""}]
[null,{"$f":"IF(Konfiguration!B297=\"\",\"\",Konfiguration!B297)","v":""},{"$f":"IF(Konfiguration!B298=\"\",\"\",Konfiguration!C298)","v":""},{"$f":"IF(Konfiguration!B297=\"\",\"\",Konfiguration!D297)","v":""}]
[null,{"$f":"IF(Konfiguration!B298=\"\",\"\",Konfiguration!B298)","v":""},{"$f":"IF(Konfiguration!B299=\"\",\"\",Konfiguration!C299)","v":""},{"$f":"IF(Konfiguration!B298=\"\",\"\",Konfiguration!D298)","v":""}]
[null,{"$f":"IF(Konfiguration!B299=\"\",\"\",Konfiguration!B299)","v":""},{"$f":"IF(Konfiguration!B300=\"\",\"\",Konfiguration!C300)","v":""},{"$f":"IF(Konfiguration!B299=\"\",\"\",Konfiguration!D299)","v":""}]
[null,{"$f":"IF(Konfiguration!B300=\"\",\"\",Konfiguration!B300)","v":""},{"$f":"IF(Konfiguration!B301=\"\",\"\",Konfiguration!C301)","v":""},{"$f":"IF(Konfiguration!B300=\"\",\"\",Konfiguration!D300)","v":""}]
[null,{"$f":"IF(Konfiguration!B301=\"\",\"\",Konfiguration!B301)","v":""},{"$f":"IF(Konfiguration!B302=\"\",\"\",Konfiguration!C302)","v":""},{"$f":"IF(Konfiguration!B301=\"\",\"\",Konfiguration!D301)","v":""}]
[null,{"$f":"IF(Konfiguration!B302=\"\",\"\",Konfiguration!B302)","v":""},{"$f":"IF(Konfiguration!B303=\"\",\"\",Konfiguration!C303)","v":""},{"$f":"IF(Konfiguration!B302=\"\",\"\",Konfiguration!D302)","v":""}]
[null,{"$f":"IF(Konfiguration!B303=\"\",\"\",Konfiguration!B303)","v":""},{"$f":"IF(Konfiguration!B304=\"\",\"\",Konfiguration!C304)","v":""},{"$f":"IF(Konfiguration!B303=\"\",\"\",Konfiguration!D303)","v":""}]
[null,{"$f":"IF(Konfiguration!B304=\"\",\"\",Konfiguration!B304)","v":""},{"$f":"IF(Konfiguration!B305=\"\",\"\",Konfiguration!C305)","v":""},{"$f":"IF(Konfiguration!B304=\"\",\"\",Konfiguration!D304)","v":""}]
[null,{"$f":"IF(Konfiguration!B305=\"\",\"\",Konfiguration!B305)","v":""},{"$f":"IF(Konfiguration!B306=\"\",\"\",Konfiguration!C306)","v":""},{"$f":"IF(Konfiguration!B305=\"\",\"\",Konfiguration!D305)","v":""}]
[null,{"$f":"IF(Konfiguration!B306=\"\",\"\",Konfiguration!B306)","v":""},{"$f":"IF(Konfiguration!B307=\"\",\"\",Konfiguration!C307)","v":""},{"$f":"IF(Konfiguration!B306=\"\",\"\",Konfiguration!D306)","v":""}]
[null,{"$f":"IF(Konfiguration!B307=\"\",\"\",Konfiguration!B307)","v":""},{"$f":"IF(Konfiguration!B308=\"\",\"\",Konfiguration!C308)","v":""},{"$f":"IF(Konfiguration!B307=\"\",\"\",Konfiguration!D307)","v":""}]
[null,{"$f":"IF(Konfiguration!B308=\"\",\"\",Konfiguration!B308)","v":""},{"$f":"IF(Konfiguration!B309=\"\",\"\",Konfiguration!C309)","v":""},{"$f":"IF(Konfiguration!B308=\"\",\"\",Konfiguration!D308)","v":""}]
[null,{"$f":"IF(Konfiguration!B309=\"\",\"\",Konfiguration!B309)","v":""},{"$f":"IF(Konfiguration!B310=\"\",\"\",Konfiguration!C310)","v":""},{"$f":"IF(Konfiguration!B309=\"\",\"\",Konfiguration!D309)","v":""}]
[null,{"$f":"IF(Konfiguration!B310=\"\",\"\",Konfiguration!B310)","v":""},{"$f":"IF(Konfiguration!B311=\"\",\"\",Konfiguration!C311)","v":""},{"$f":"IF(Konfiguration!B310=\"\",\"\",Konfiguration!D310)","v":""}]
[null,{"$f":"IF(Konfiguration!B311=\"\",\"\",Konfiguration!B311)","v":""},{"$f":"IF(Konfiguration!B312=\"\",\"\",Konfiguration!C312)","v":""},{"$f":"IF(Konfiguration!B311=\"\",\"\",Konfiguration!D311)","v":""}]
[null,{"$f":"IF(Konfiguration!B312=\"\",\"\",Konfiguration!B312)","v":""},{"$f":"IF(Konfiguration!B313=\"\",\"\",Konfiguration!C313)","v":""},{"$f":"IF(Konfiguration!B312=\"\",\"\",Konfiguration!D312)","v":""}]
[null,{"$f":"IF(Konfiguration!B313=\"\",\"\",Konfiguration!B313)","v":""},{"$f":"IF(Konfiguration!B314=\"\",\"\",Konfiguration!C314)","v":""},{"$f":"IF(Konfiguration!B313=\"\",\"\",Konfiguration!D313)","v":""}]
[null,{"$f":"IF(Konfiguration!B314=\"\",\"\",Konfiguration!B314)","v":""},{"$f":"IF(Konfiguration!B315=\"\",\"\",Konfiguration!C315)","v":""},{"$f":"IF(Konfiguration!B314=\"\",\"\",Konfiguration!D314)","v":""}]
[null,{"$f":"IF(Konfiguration!B315=\"\",\"\",Konfiguration!B315)","v":""},{"$f":"IF(Konfiguration!B316=\"\",\"\",Konfiguration!C316)","v":""},{"$f":"IF(Konfiguration!B315=\"\",\"\",Konfiguration!D315)","v":""}]
[null,{"$f":"IF(Konfiguration!B316=\"\",\"\",Konfiguration!B316)","v":""},{"$f":"IF(Konfiguration!B317=\"\",\"\",Konfiguration!C317)","v":""},{"$f":"IF(Konfiguration!B316=\"\",\"\",Konfiguration!D316)","v":""}]
[null,{"$f":"IF(Konfiguration!B317=\"\",\"\",Konfiguration!B317)","v":""},{"$f":"IF(Konfiguration!B318=\"\",\"\",Konfiguration!C318)","v":""},{"$f":"IF(Konfiguration!B317=\"\",\"\",Konfiguration!D317)","v":""}]
[null,{"$f":"IF(Konfiguration!B318=\"\",\"\",Konfiguration!B318)","v":""},{"$f":"IF(Konfiguration!B319=\"\",\"\",Konfiguration!C319)","v":""},{"$f":"IF(Konfiguration!B318=\"\",\"\",Konfiguration!D318)","v":""}]
[null,{"$f":"IF(Konfiguration!B319=\"\",\"\",Konfiguration!B319)","v":""},{"$f":"IF(Konfiguration!B320=\"\",\"\",Konfiguration!C320)","v":""},{"$f":"IF(Konfiguration!B319=\"\",\"\",Konfiguration!D319)","v":""}]
[null,{"$f":"IF(Konfiguration!B320=\"\",\"\",Konfiguration!B320)","v":""},{"$f":"IF(Konfiguration!B321=\"\",\"\",Konfiguration!C321)","v":""},{"$f":"IF(Konfiguration!B320=\"\",\"\",Konfiguration!D320)","v":""}]
[null,{"$f":"IF(Konfiguration!B321=\"\",\"\",Konfiguration!B321)","v":""},{"$f":"IF(Konfiguration!B322=\"\",\"\",Konfiguration!C322)","v":""},{"$f":"IF(Konfiguration!B321=\"\",\"\",Konfiguration!D321)","v":""}]
[null,{"$f":"IF(Konfiguration!B322=\"\",\"\",Konfiguration!B322)","v":""},{"$f":"IF(Konfiguration!B323=\"\",\"\",Konfiguration!C323)","v":""},{"$f":"IF(Konfiguration!B322=\"\",\"\",Konfiguration!D322)","v":""}]
[null,{"$f":"IF(Konfiguration!B323=\"\",\"\",Konfiguration!B323)","v":""},{"$f":"IF(Konfiguration!B324=\"\",\"\",Konfiguration!C324)","v":""},{"$f":"IF(Konfiguration!B323=\"\",\"\",Konfiguration!D323)","v":""}]
[null,{"$f":"IF(Konfiguration!B324=\"\",\"\",Konfiguration!B324)","v":""},{"$f":"IF(Konfiguration!B325=\"\",\"\",Konfiguration!C325)","v":""},{"$f":"IF(Konfiguration!B324=\"\",\"\",Konfiguration!D324)","v":""}]
[null,{"$f":"IF(Konfiguration!B325=\"\",\"\",Konfiguration!B325)","v":""},{"$f":"IF(Konfiguration!B326=\"\",\"\",Konfiguration!C326)","v":""},{"$f":"IF(Konfiguration!B325=\"\",\"\",Konfiguration!D325)","v":""}]
[null,{"$f":"IF(Konfiguration!B326=\"\",\"\",Konfiguration!B326)","v":""},{"$f":"IF(Konfiguration!B327=\"\",\"\",Konfiguration!C327)","v":""},{"$f":"IF(Konfiguration!B326=\"\",\"\",Konfiguration!D326)","v":""}]
[null,{"$f":"IF(Konfiguration!B327=\"\",\"\",Konfiguration!B327)","v":""},{"$f":"IF(Konfiguration!B328=\"\",\"\",Konfiguration!C328)","v":""},{"$f":"IF(Konfiguration!B327=\"\",\"\",Konfiguration!D327)","v":""}]
[null,{"$f":"IF(Konfiguration!B328=\"\",\"\",Konfiguration!B328)","v":""},{"$f":"IF(Konfiguration!B329=\"\",\"\",Konfiguration!C329)","v":""},{"$f":"IF(Konfiguration!B328=\"\",\"\",Konfiguration!D328)","v":""}]
[null,{"$f":"IF(Konfiguration!B329=\"\",\"\",Konfiguration!B329)","v":""},{"$f":"IF(Konfiguration!B330=\"\",\"\",Konfiguration!C330)","v":""},{"$f":"IF(Konfiguration!B329=\"\",\"\",Konfiguration!D329)","v":""}]
[null,{"$f":"IF(Konfiguration!B330=\"\",\"\",Konfiguration!B330)","v":""},{"$f":"IF(Konfiguration!B331=\"\",\"\",Konfiguration!C331)","v":""},{"$f":"IF(Konfiguration!B330=\"\",\"\",Konfiguration!D330)","v":""}]
[null,{"$f":"IF(Konfiguration!B331=\"\",\"\",Konfiguration!B331)","v":""},{"$f":"IF(Konfiguration!B332=\"\",\"\",Konfiguration!C332)","v":""},{"$f":"IF(Konfiguration!B331=\"\",\"\",Konfiguration!D331)","v":""}]
[null,{"$f":"IF(Konfiguration!B332=\"\",\"\",Konfiguration!B332)","v":""},{"$f":"IF(Konfiguration!B333=\"\",\"\",Konfiguration!C333)","v":""},{"$f":"IF(Konfiguration!B332=\"\",\"\",Konfiguration!D332)","v":""}]
[null,{"$f":"IF(Konfiguration!B334=\"\",\"\",Konfiguration!B334)","v":""},{"$f":"IF(Konfiguration!B334=\"\",\"\",Konfiguration!C334)","v":""},{"$f":"IF(Konfiguration!B333=\"\",\"\",Konfiguration!D333)","v":""}]
[null,{"$f":"IF(Konfiguration!B335=\"\",\"\",Konfiguration!B335)","v":""},{"$f":"IF(Konfiguration!B335=\"\",\"\",Konfiguration!C335)","v":""},{"$f":"IF(Konfiguration!B334=\"\",\"\",Konfiguration!D334)","v":""}]
[null,{"$f":"IF(Konfiguration!B336=\"\",\"\",Konfiguration!B336)","v":""},{"$f":"IF(Konfiguration!B336=\"\",\"\",Konfiguration!C336)","v":""},{"$f":"IF(Konfiguration!B335=\"\",\"\",Konfiguration!D335)","v":""}]
[null,{"$f":"IF(Konfiguration!B337=\"\",\"\",Konfiguration!B337)","v":""},{"$f":"IF(Konfiguration!B337=\"\",\"\",Konfiguration!C337)","v":""},{"$f":"IF(Konfiguration!B336=\"\",\"\",Konfiguration!D336)","v":""}]
[null,{"$f":"IF(Konfiguration!B338=\"\",\"\",Konfiguration!B338)","v":""},{"$f":"IF(Konfiguration!B338=\"\",\"\",Konfiguration!C338)","v":""},{"$f":"IF(Konfiguration!B337=\"\",\"\",Konfiguration!D337)","v":""}]
[null,{"$f":"IF(Konfiguration!B339=\"\",\"\",Konfiguration!B339)","v":""},{"$f":"IF(Konfiguration!B339=\"\",\"\",Konfiguration!C339)","v":""},{"$f":"IF(Konfiguration!B338=\"\",\"\",Konfiguration!D338)","v":""}]
[null,{"$f":"IF(Konfiguration!B340=\"\",\"\",Konfiguration!B340)","v":""},{"$f":"IF(Konfiguration!B340=\"\",\"\",Konfiguration!C340)","v":""},{"$f":"IF(Konfiguration!B339=\"\",\"\",Konfiguration!D339)","v":""}]
[null,{"$f":"IF(Konfiguration!B341=\"\",\"\",Konfiguration!B341)","v":""},{"$f":"IF(Konfiguration!B341=\"\",\"\",Konfiguration!C341)","v":""},{"$f":"IF(Konfiguration!B340=\"\",\"\",Konfiguration!D340)","v":""}]
[null,{"$f":"IF(Konfiguration!B342=\"\",\"\",Konfiguration!B342)","v":""},{"$f":"IF(Konfiguration!B342=\"\",\"\",Konfiguration!C342)","v":""},{"$f":"IF(Konfiguration!B341=\"\",\"\",Konfiguration!D341)","v":""}]
[null,{"$f":"IF(Konfiguration!B343=\"\",\"\",Konfiguration!B343)","v":""},{"$f":"IF(Konfiguration!B343=\"\",\"\",Konfiguration!C343)","v":""},{"$f":"IF(Konfiguration!B342=\"\",\"\",Konfiguration!D342)","v":""}]
[null,{"$f":"IF(Konfiguration!B344=\"\",\"\",Konfiguration!B344)","v":""},{"$f":"IF(Konfiguration!B344=\"\",\"\",Konfiguration!C344)","v":""},{"$f":"IF(Konfiguration!B343=\"\",\"\",Konfiguration!D343)","v":""}]
[null,{"$f":"IF(Konfiguration!B345=\"\",\"\",Konfiguration!B345)","v":""},{"$f":"IF(Konfiguration!B345=\"\",\"\",Konfiguration!C345)","v":""},{"$f":"IF(Konfiguration!B345=\"\",\"\",Konfiguration!D345)","v":""}]
[null,{"$f":"IF(Konfiguration!B346=\"\",\"\",Konfiguration!B346)","v":""},{"$f":"IF(Konfiguration!B346=\"\",\"\",Konfiguration!C346)","v":""},{"$f":"IF(Konfiguration!B346=\"\",\"\",Konfiguration!D346)","v":""}]
[null,{"$f":"IF(Konfiguration!B347=\"\",\"\",Konfiguration!B347)","v":""},{"$f":"IF(Konfiguration!B347=\"\",\"\",Konfiguration!C347)","v":""},{"$f":"IF(Konfiguration!B347=\"\",\"\",Konfiguration!D347)","v":""}]
[null,{"$f":"IF(Konfiguration!B348=\"\",\"\",Konfiguration!B348)","v":""},{"$f":"IF(Konfiguration!B348=\"\",\"\",Konfiguration!C348)","v":""},{"$f":"IF(Konfiguration!B348=\"\",\"\",Konfiguration!D348)","v":""}]
[null,{"$f":"IF(Konfiguration!B349=\"\",\"\",Konfiguration!B349)","v":""},{"$f":"IF(Konfiguration!B349=\"\",\"\",Konfiguration!C349)","v":""},{"$f":"IF(Konfiguration!B349=\"\",\"\",Konfiguration!D349)","v":""}]
[null,{"$f":"IF(Konfiguration!B350=\"\",\"\",Konfiguration!B350)","v":""},{"$f":"IF(Konfiguration!B350=\"\",\"\",Konfiguration!C350)","v":""},{"$f":"IF(Konfiguration!B350=\"\",\"\",Konfiguration!D350)","v":""}]

{"sheet":"Abrechnung","index":5,"n_rows":1050,"n_cols":12,"rows_kept":1050,"cut":false,"hidden":false,"merged":[[9,5,9,6],[9,10,9,11],[1,1,2,10],[3,1,3,10]]}
[]
[null,"ABRECHNUNG"]
[]
[null,{"$f":"Konfiguration!G5","v":"Spieleabend (Test)"}]
[]
[null,"Antragshöhe:",null,null,null,{"$f":"SUM(F13:F1048576)","v":170},null,null,null,null,"Bilanz:",{"$f":"L8-F8","v":-70.75}]
[]
[null,"Ausgegeben:",null,null,null,{"$f":"SUM(K13:K1048576)","v":83.75},null,null,null,null,"Eingenommen:",{"$f":"SUM(L13:L1048576)","v":13}]
[]
[null,null,null,null,null,"Kalkulation",null,null,null,null,"tatsächlich"]
[null,"Posten",null,null,null,"Ausgaben","Einnahmen",null,null,null,"Ausgaben","Einnahmen"]
[]
[null,{"$f":"IF(Konfiguration!B3=\"\",\"\",Konfiguration!B3)","v":"Snacks"},null,null,null,{"$f":"IF(Konfiguration!B3=\"\",\"\",Konfiguration!C3)","v":20},{"$f":"IF(Konfiguration!B3=\"\",\"\",Konfiguration!D3)","v":0},null,null,null,{"$f":"IF(B13=\"\",\"\",SUMIF(Ausgaben!B:B,B13,Ausgaben!A:A))","v":13.75},{"$f":"IF(B13=\"\",\"\",SUMIF(Einnahmen!B:B,B13,Einnahmen!A:A))","v":0}]
[null,{"$f":"IF(Konfiguration!B4=\"\",\"\",Konfiguration!B4)","v":"Getränke"},null,null,null,{"$f":"IF(Konfiguration!B4=\"\",\"\",Konfiguration!C4)","v":50},{"$f":"IF(Konfiguration!B4=\"\",\"\",Konfiguration!D4)","v":0},null,null,null,{"$f":"IF(B14=\"\",\"\",SUMIF(Ausgaben!B:B,B14,Ausgaben!A:A))","v":60},{"$f":"IF(B14=\"\",\"\",SUMIF(Einnahmen!B:B,B14,Einnahmen!A:A))","v":0}]
[null,{"$f":"IF(Konfiguration!B5=\"\",\"\",Konfiguration!B5)","v":"Spiele"},null,null,null,{"$f":"IF(Konfiguration!B5=\"\",\"\",Konfiguration!C5)","v":100},{"$f":"IF(Konfiguration!B5=\"\",\"\",Konfiguration!D5)","v":0},null,null,null,{"$f":"IF(B15=\"\",\"\",SUMIF(Ausgaben!B:B,B15,Ausgaben!A:A))","v":10},{"$f":"IF(B15=\"\",\"\",SUMIF(Einnahmen!B:B,B15,Einnahmen!A:A))","v":0}]
[null,{"$f":"IF(Konfiguration!B6=\"\",\"\",Konfiguration!B6)","v":"Ticketverkauf"},null,null,null,{"$f":"IF(Konfiguration!B6=\"\",\"\",Konfiguration!C6)","v":0},{"$f":"IF(Konfiguration!B6=\"\",\"\",Konfiguration!D6)","v":20},null,null,null,{"$f":"IF(B16=\"\",\"\",SUMIF(Ausgaben!B:B,B16,Ausgaben!A:A))","v":0},{"$f":"IF(B16=\"\",\"\",SUMIF(Einnahmen!B:B,B16,Einnahmen!A:A))","v":13}]
[null,{"$f":"IF(Konfiguration!B7=\"\",\"\",Konfiguration!B7)","v":""},null,null,null,{"$f":"IF(Konfiguration!B7=\"\",\"\",Konfiguration!C7)","v":""},{"$f":"IF(Konfiguration!B7=\"\",\"\",Konfiguration!D7)","v":""},null,null,null,{"$f":"IF(B17=\"\",\"\",SUMIF(Ausgaben!B:B,B17,Ausgaben!A:A))","v":""},{"$f":"IF(B17=\"\",\"\",SUMIF(Einnahmen!B:B,B17,Einnahmen!A:A))","v":""}]
[null,{"$f":"IF(Konfiguration!B8=\"\",\"\",Konfiguration!B8)","v":""},null,null,null,{"$f":"IF(Konfiguration!B8=\"\",\"\",Konfiguration!C8)","v":""},{"$f":"IF(Konfiguration!B8=\"\",\"\",Konfiguration!D8)","v":""},null,null,null,{"$f":"IF(B18=\"\",\"\",SUMIF(Ausgaben!B:B,B18,Ausgaben!A:A))","v":""},{"$f":"IF(B18=\"\",\"\",SUMIF(Einnahmen!B:B,B18,Einnahmen!A:A))","v":""}]
[null,{"$f":"IF(Konfiguration!B9=\"\",\"\",Konfiguration!B9)","v":""},null,null,null,{"$f":"IF(Konfiguration!B9=\"\",\"\",Konfiguration!C9)","v":""},{"$f":"IF(Konfiguration!B9=\"\",\"\",Konfiguration!D9)","v":""},null,null,null,{"$f":"IF(B19=\"\",\"\",SUMIF(Ausgaben!B:B,B19,Ausgaben!A:A))","v":""},{"$f":"IF(B19=\"\",\"\",SUMIF(Einnahmen!B:B,B19,Einnahmen!A:A))","v":""}]
[null,{"$f":"IF(Konfiguration!B10=\"\",\"\",Konfiguration!B10)","v":""},null,null,null,{"$f":"IF(Konfiguration!B10=\"\",\"\",Konfiguration!C10)","v":""},{"$f":"IF(Konfiguration!B10=\"\",\"\",Konfiguration!D10)","v":""},null,null,null,{"$f":"IF(B20=\"\",\"\",SUMIF(Ausgaben!B:B,B20,Ausgaben!A:A))","v":""},{"$f":"IF(B20=\"\",\"\",SUMIF(Einnahmen!B:B,B20,Einnahmen!A:A))","v":""}]
[null,{"$f":"IF(Konfiguration!B11=\"\",\"\",Konfiguration!B11)","v":""},null,null,null,{"$f":"IF(Konfiguration!B11=\"\",\"\",Konfiguration!C11)","v":""},{"$f":"IF(Konfiguration!B11=\"\",\"\",Konfiguration!D11)","v":""},null,null,null,{"$f":"IF(B21=\"\",\"\",SUMIF(Ausgaben!B:B,B21,Ausgaben!A:A))","v":""},{"$f":"IF(B21=\"\",\"\",SUMIF(Einnahmen!B:B,B21,Einnahmen!A:A))","v":""}]
[null,{"$f":"IF(Konfiguration!B12=\"\",\"\",Konfiguration!B12)","v":""},null,null,null,{"$f":"IF(Konfiguration!B12=\"\",\"\",Konfiguration!C12)","v":""},{"$f":"IF(Konfiguration!B12=\"\",\"\",Konfiguration!D12)","v":""},null,null,null,{"$f":"IF(B22=\"\",\"\",SUMIF(Ausgaben!B:B,B22,Ausgaben!A:A))","v":""},{"$f":"IF(B22=\"\",\"\",SUMIF(Einnahmen!B:B,B22,Einnahmen!A:A))","v":""}]
[null,{"$f":"IF(Konfiguration!B13=\"\",\"\",Konfiguration!B13)","v":""},null,null,null,{"$f":"IF(Konfiguration!B13=\"\",\"\",Konfiguration!C13)","v":""},{"$f":"IF(Konfiguration!B13=\"\",\"\",Konfiguration!D13)","v":""},null,null,null,{"$f":"IF(B23=\"\",\"\",SUMIF(Ausgaben!B:B,B23,Ausgaben!A:A))","v":""},{"$f":"IF(B23=\"\",\"\",SUMIF(Einnahmen!B:B,B23,Einnahmen!A:A))","v":""}]
[null,{"$f":"IF(Konfiguration!B14=\"\",\"\",Konfiguration!B14)","v":""},null,null,null,{"$f":"IF(Konfiguration!B14=\"\",\"\",Konfiguration!C14)","v":""},{"$f":"IF(Konfiguration!B14=\"\",\"\",Konfiguration!D14)","v":""},null,null,null,{"$f":"IF(B24=\"\",\"\",SUMIF(Ausgaben!B:B,B24,Ausgaben!A:A))","v":""},{"$f":"IF(B24=\"\",\"\",SUMIF(Einnahmen!B:B,B24,Einnahmen!A:A))","v":""}]
[null,{"$f":"IF(Konfiguration!B15=\"\",\"\",Konfiguration!B15)","v":""},null,null,null,{"$f":"IF(Konfiguration!B15=\"\",\"\",Konfiguration!C15)","v":""},{"$f":"IF(Konfiguration!B15=\"\",\"\",Konfiguration!D15)","v":""},null,null,null,{"$f":"IF(B25=\"\",\"\",SUMIF(Ausgaben!B:B,B25,Ausgaben!A:A))","v":""},{"$f":"IF(B25=\"\",\"\",SUMIF(Einnahmen!B:B,B25,Einnahmen!A:A))","v":""}]
[null,{"$f":"IF(Konfiguration!B16=\"\",\"\",Konfiguration!B16)","v":""},null,null,null,{"$f":"IF(Konfiguration!B16=\"\",\"\",Konfiguration!C16)","v":""},{"$f":"IF(Konfiguration!B16=\"\",\"\",Konfiguration!D16)","v":""},null,null,null,{"$f":"IF(B26=\"\",\"\",SUMIF(Ausgaben!B:B,B26,Ausgaben!A:A))","v":""},{"$f":"IF(B26=\"\",\"\",SUMIF(Einnahmen!B:B,B26,Einnahmen!A:A))","v":""}]
[null,{"$f":"IF(Konfiguration!B17=\"\",\"\",Konfiguration!B17)","v":""},null,null,null,{"$f":"IF(Konfiguration!B17=\"\",\"\",Konfiguration!C17)","v":""},{"$f":"IF(Konfiguration!B17=\"\",\"\",Konfiguration!D17)","v":""},null,null,null,{"$f":"IF(B27=\"\",\"\",SUMIF(Ausgaben!B:B,B27,Ausgaben!A:A))","v":""},{"$f":"IF(B27=\"\",\"\",SUMIF(Einnahmen!B:B,B27,Einnahmen!A:A))","v":""}]
[null,{"$f":"IF(Konfiguration!B18=\"\",\"\",Konfiguration!B18)","v":""},null,null,null,{"$f":"IF(Konfiguration!B18=\"\",\"\",Konfiguration!C18)","v":""},{"$f":"IF(Konfiguration!B18=\"\",\"\",Konfiguration!D18)","v":""},null,null,null,{"$f":"IF(B28=\"\",\"\",SUMIF(Ausgaben!B:B,B28,Ausgaben!A:A))","v":""},{"$f":"IF(B28=\"\",\"\",SUMIF(Einnahmen!B:B,B28,Einnahmen!A:A))","v":""}]
[null,{"$f":"IF(Konfiguration!B19=\"\",\"\",Konfiguration!B19)","v":""},null,null,null,{"$f":"IF(Konfiguration!B19=\"\",\"\",Konfiguration!C19)","v":""},{"$f":"IF(Konfiguration!B19=\"\",\"\",Konfiguration!D19)","v":""},null,null,null,{"$f":"IF(B29=\"\",\"\",SUMIF(Ausgaben!B:B,B29,Ausgaben!A:A))","v":""},{"$f":"IF(B29=\"\",\"\",SUMIF(Einnahmen!B:B,B29,Einnahmen!A:A))","v":""}]
[null,{"$f":"IF(Konfiguration!B20=\"\",\"\",Konfiguration!B20)","v":""},null,null,null,{"$f":"IF(Konfiguration!B20=\"\",\"\",Konfiguration!C20)","v":""},{"$f":"IF(Konfiguration!B20=\"\",\"\",Konfiguration!D20)","v":""},null,null,null,{"$f":"IF(B30=\"\",\"\",SUMIF(Ausgaben!B:B,B30,Ausgaben!A:A))","v":""},{"$f":"IF(B30=\"\",\"\",SUMIF(Einnahmen!B:B,B30,Einnahmen!A:A))","v":""}]
[null,{"$f":"IF(Konfiguration!B21=\"\",\"\",Konfiguration!B21)","v":""},null,null,null,{"$f":"IF(Konfiguration!B21=\"\",\"\",Konfiguration!C21)","v":""},{"$f":"IF(Konfiguration!B21=\"\",\"\",Konfiguration!D21)","v":""},null,null,null,{"$f":"IF(B31=\"\",\"\",SUMIF(Ausgaben!B:B,B31,Ausgaben!A:A))","v":""},{"$f":"IF(B31=\"\",\"\",SUMIF(Einnahmen!B:B,B31,Einnahmen!A:A))","v":""}]
[null,{"$f":"IF(Konfiguration!B22=\"\",\"\",Konfiguration!B22)","v":""},null,null,null,{"$f":"IF(Konfiguration!B22=\"\",\"\",Konfiguration!C22)","v":""},{"$f":"IF(Konfiguration!B22=\"\",\"\",Konfiguration!D22)","v":""},null,null,null,{"$f":"IF(B32=\"\",\"\",SUMIF(Ausgaben!B:B,B32,Ausgaben!A:A))","v":""},{"$f":"IF(B32=\"\",\"\",SUMIF(Einnahmen!B:B,B32,Einnahmen!A:A))","v":""}]
[null,{"$f":"IF(Konfiguration!B23=\"\",\"\",Konfiguration!B23)","v":""},null,null,null,{"$f":"IF(Konfiguration!B23=\"\",\"\",Konfiguration!C23)","v":""},{"$f":"IF(Konfiguration!B23=\"\",\"\",Konfiguration!D23)","v":""},null,null,null,{"$f":"IF(B33=\"\",\"\",SUMIF(Ausgaben!B:B,B33,Ausgaben!A:A))","v":""},{"$f":"IF(B33=\"\",\"\",SUMIF(Einnahmen!B:B,B33,Einnahmen!A:A))","v":""}]
[null,{"$f":"IF(Konfiguration!B24=\"\",\"\",Konfiguration!B24)","v":""},null,null,null,{"$f":"IF(Konfiguration!B24=\"\",\"\",Konfiguration!C24)","v":""},{"$f":"IF(Konfiguration!B24=\"\",\"\",Konfiguration!D24)","v":""},null,null,null,{"$f":"IF(B34=\"\",\"\",SUMIF(Ausgaben!B:B,B34,Ausgaben!A:A))","v":""},{"$f":"IF(B34=\"\",\"\",SUMIF(Einnahmen!B:B,B34,Einnahmen!A:A))","v":""}]
[null,{"$f":"IF(Konfiguration!B25=\"\",\"\",Konfiguration!B25)","v":""},null,null,null,{"$f":"IF(Konfiguration!B25=\"\",\"\",Konfiguration!C25)","v":""},{"$f":"IF(Konfiguration!B25=\"\",\"\",Konfiguration!D25)","v":""},null,null,null,{"$f":"IF(B35=\"\",\"\",SUMIF(Ausgaben!B:B,B35,Ausgaben!A:A))","v":""},{"$f":"IF(B35=\"\",\"\",SUMIF(Einnahmen!B:B,B35,Einnahmen!A:A))","v":""}]
[null,{"$f":"IF(Konfiguration!B26=\"\",\"\",Konfiguration!B26)","v":""},null,null,null,{"$f":"IF(Konfiguration!B26=\"\",\"\",Konfiguration!C26)","v":""},{"$f":"IF(Konfiguration!B26=\"\",\"\",Konfiguration!D26)","v":""},null,null,null,{"$f":"IF(B36=\"\",\"\",SUMIF(Ausgaben!B:B,B36,Ausgaben!A:A))","v":""},{"$f":"IF(B36=\"\",\"\",SUMIF(Einnahmen!B:B,B36,Einnahmen!A:A))","v":""}]
[null,{"$f":"IF(Konfiguration!B27=\"\",\"\",Konfiguration!B27)","v":""},null,null,null,{"$f":"IF(Konfiguration!B27=\"\",\"\",Konfiguration!C27)","v":""},{"$f":"IF(Konfiguration!B27=\"\",\"\",Konfiguration!D27)","v":""},null,null,null,{"$f":"IF(B37=\"\",\"\",SUMIF(Ausgaben!B:B,B37,Ausgaben!A:A))","v":""},{"$f":"IF(B37=\"\",\"\",SUMIF(Einnahmen!B:B,B37,Einnahmen!A:A))","v":""}]
[null,{"$f":"IF(Konfiguration!B28=\"\",\"\",Konfiguration!B28)","v":""},null,null,null,{"$f":"IF(Konfiguration!B28=\"\",\"\",Konfiguration!C28)","v":""},{"$f":"IF(Konfiguration!B28=\"\",\"\",Konfiguration!D28)","v":""},null,null,null,{"$f":"IF(B38=\"\",\"\",SUMIF(Ausgaben!B:B,B38,Ausgaben!A:A))","v":""},{"$f":"IF(B38=\"\",\"\",SUMIF(Einnahmen!B:B,B38,Einnahmen!A:A))","v":""}]
[null,{"$f":"IF(Konfiguration!B29=\"\",\"\",Konfiguration!B29)","v":""},null,null,null,{"$f":"IF(Konfiguration!B29=\"\",\"\",Konfiguration!C29)","v":""},{"$f":"IF(Konfiguration!B29=\"\",\"\",Konfiguration!D29)","v":""},null,null,null,{"$f":"IF(B39=\"\",\"\",SUMIF(Ausgaben!B:B,B39,Ausgaben!A:A))","v":""},{"$f":"IF(B39=\"\",\"\",SUMIF(Einnahmen!B:B,B39,Einnahmen!A:A))","v":""}]
[null,{"$f":"IF(Konfiguration!B30=\"\",\"\",Konfiguration!B30)","v":""},null,null,null,{"$f":"IF(Konfiguration!B30=\"\",\"\",Konfiguration!C30)","v":""},{"$f":"IF(Konfiguration!B30=\"\",\"\",Konfiguration!D30)","v":""},null,null,null,{"$f":"IF(B40=\"\",\"\",SUMIF(Ausgaben!B:B,B40,Ausgaben!A:A))","v":""},{"$f":"IF(B40=\"\",\"\",SUMIF(Einnahmen!B:B,B40,Einnahmen!A:A))","v":""}]
[null,{"$f":"IF(Konfiguration!B31=\"\",\"\",Konfiguration!B31)","v":""},null,null,null,{"$f":"IF(Konfiguration!B31=\"\",\"\",Konfiguration!C31)","v":""},{"$f":"IF(Konfiguration!B31=\"\",\"\",Konfiguration!D31)","v":""},null,null,null,{"$f":"IF(B41=\"\",\"\",SUMIF(Ausgaben!B:B,B41,Ausgaben!A:A))","v":""},{"$f":"IF(B41=\"\",\"\",SUMIF(Einnahmen!B:B,B41,Einnahmen!A:A))","v":""}]
[null,{"$f":"IF(Konfiguration!B32=\"\",\"\",Konfiguration!B32)","v":""},null,null,null,{"$f":"IF(Konfiguration!B32=\"\",\"\",Konfiguration!C32)","v":""},{"$f":"IF(Konfiguration!B32=\"\",\"\",Konfiguration!D32)","v":""},null,null,null,{"$f":"IF(B42=\"\",\"\",SUMIF(Ausgaben!B:B,B42,Ausgaben!A:A))","v":""},{"$f":"IF(B42=\"\",\"\",SUMIF(Einnahmen!B:B,B42,Einnahmen!A:A))","v":""}]
[null,{"$f":"IF(Konfiguration!B33=\"\",\"\",Konfiguration!B33)","v":""},null,null,null,{"$f":"IF(Konfiguration!B33=\"\",\"\",Konfiguration!C33)","v":""},{"$f":"IF(Konfiguration!B33=\"\",\"\",Konfiguration!D33)","v":""},null,null,null,{"$f":"IF(B43=\"\",\"\",SUMIF(Ausgaben!B:B,B43,Ausgaben!A:A))","v":""},{"$f":"IF(B43=\"\",\"\",SUMIF(Einnahmen!B:B,B43,Einnahmen!A:A))","v":""}]
[null,{"$f":"IF(Konfiguration!B34=\"\",\"\",Konfiguration!B34)","v":""},null,null,null,{"$f":"IF(Konfiguration!B34=\"\",\"\",Konfiguration!C34)","v":""},{"$f":"IF(Konfiguration!B34=\"\",\"\",Konfiguration!D34)","v":""},null,null,null,{"$f":"IF(B44=\"\",\"\",SUMIF(Ausgaben!B:B,B44,Ausgaben!A:A))","v":""},{"$f":"IF(B44=\"\",\"\",SUMIF(Einnahmen!B:B,B44,Einnahmen!A:A))","v":""}]
[null,{"$f":"IF(Konfiguration!B35=\"\",\"\",Konfiguration!B35)","v":""},null,null,null,{"$f":"IF(Konfiguration!B35=\"\",\"\",Konfiguration!C35)","v":""},{"$f":"IF(Konfiguration!B35=\"\",\"\",Konfiguration!D35)","v":""},null,null,null,{"$f":"IF(B45=\"\",\"\",SUMIF(Ausgaben!B:B,B45,Ausgaben!A:A))","v":""},{"$f":"IF(B45=\"\",\"\",SUMIF(Einnahmen!B:B,B45,Einnahmen!A:A))","v":""}]
[null,{"$f":"IF(Konfiguration!B36=\"\",\"\",Konfiguration!B36)","v":""},null,null,null,{"$f":"IF(Konfiguration!B36=\"\",\"\",Konfiguration!C36)","v":""},{"$f":"IF(Konfiguration!B36=\"\",\"\",Konfiguration!D36)","v":""},null,null,null,{"$f":"IF(B46=\"\",\"\",SUMIF(Ausgaben!B:B,B46,Ausgaben!A:A))","v":""},{"$f":"IF(B46=\"\",\"\",SUMIF(Einnahmen!B:B,B46,Einnahmen!A:A))","v":""}]
[null,{"$f":"IF(Konfiguration!B37=\"\",\"\",Konfiguration!B37)","v":""},null,null,null,{"$f":"IF(Konfiguration!B37=\"\",\"\",Konfiguration!C37)","v":""},{"$f":"IF(Konfiguration!B37=\"\",\"\",Konfiguration!D37)","v":""},null,null,null,{"$f":"IF(B47=\"\",\"\",SUMIF(Ausgaben!B:B,B47,Ausgaben!A:A))","v":""},{"$f":"IF(B47=\"\",\"\",SUMIF(Einnahmen!B:B,B47,Einnahmen!A:A))","v":""}]
[null,{"$f":"IF(Konfiguration!B38=\"\",\"\",Konfiguration!B38)","v":""},null,null,null,{"$f":"IF(Konfiguration!B38=\"\",\"\",Konfiguration!C38)","v":""},{"$f":"IF(Konfiguration!B38=\"\",\"\",Konfiguration!D38)","v":""},null,null,null,{"$f":"IF(B48=\"\",\"\",SUMIF(Ausgaben!B:B,B48,Ausgaben!A:A))","v":""},{"$f":"IF(B48=\"\",\"\",SUMIF(Einnahmen!B:B,B48,Einnahmen!A:A))","v":""}]
[null,{"$f":"IF(Konfiguration!B39=\"\",\"\",Konfiguration!B39)","v":""},null,null,null,{"$f":"IF(Konfiguration!B39=\"\",\"\",Konfiguration!C39)","v":""},{"$f":"IF(Konfiguration!B39=\"\",\"\",Konfiguration!D39)","v":""},null,null,null,{"$f":"IF(B49=\"\",\"\",SUMIF(Ausgaben!B:B,B49,Ausgaben!A:A))","v":""},{"$f":"IF(B49=\"\",\"\",SUMIF(Einnahmen!B:B,B49,Einnahmen!A:A))","v":""}]
[null,{"$f":"IF(Konfiguration!B40=\"\",\"\",Konfiguration!B40)","v":""},null,null,null,{"$f":"IF(Konfiguration!B40=\"\",\"\",Konfiguration!C40)","v":""},{"$f":"IF(Konfiguration!B40=\"\",\"\",Konfiguration!D40)","v":""},null,null,null,{"$f":"IF(B50=\"\",\"\",SUMIF(Ausgaben!B:B,B50,Ausgaben!A:A))","v":""},{"$f":"IF(B50=\"\",\"\",SUMIF(Einnahmen!B:B,B50,Einnahmen!A:A))","v":""}]
[null,{"$f":"IF(Konfiguration!B41=\"\",\"\",Konfiguration!B41)","v":""},null,null,null,{"$f":"IF(Konfiguration!B41=\"\",\"\",Konfiguration!C41)","v":""},{"$f":"IF(Konfiguration!B41=\"\",\"\",Konfiguration!D41)","v":""},null,null,null,{"$f":"IF(B51=\"\",\"\",SUMIF(Ausgaben!B:B,B51,Ausgaben!A:A))","v":""},{"$f":"IF(B51=\"\",\"\",SUMIF(Einnahmen!B:B,B51,Einnahmen!A:A))","v":""}]
[null,{"$f":"IF(Konfiguration!B42=\"\",\"\",Konfiguration!B42)","v":""},null,null,null,{"$f":"IF(Konfiguration!B42=\"\",\"\",Konfiguration!C42)","v":""},{"$f":"IF(Konfiguration!B42=\"\",\"\",Konfiguration!D42)","v":""},null,null,null,{"$f":"IF(B52=\"\",\"\",SUMIF(Ausgaben!B:B,B52,Ausgaben!A:A))","v":""},{"$f":"IF(B52=\"\",\"\",SUMIF(Einnahmen!B:B,B52,Einnahmen!A:A))","v":""}]
[null,{"$f":"IF(Konfiguration!B43=\"\",\"\",Konfiguration!B43)","v":""},null,null,null,{"$f":"IF(Konfiguration!B43=\"\",\"\",Konfiguration!C43)","v":""},{"$f":"IF(Konfiguration!B43=\"\",\"\",Konfiguration!D43)","v":""},null,null,null,{"$f":"IF(B53=\"\",\"\",SUMIF(Ausgaben!B:B,B53,Ausgaben!A:A))","v":""},{"$f":"IF(B53=\"\",\"\",SUMIF(Einnahmen!B:B,B53,Einnahmen!A:A))","v":""}]
[null,{"$f":"IF(Konfiguration!B44=\"\",\"\",Konfiguration!B44)","v":""},null,null,null,{"$f":"IF(Konfiguration!B44=\"\",\"\",Konfiguration!C44)","v":""},{"$f":"IF(Konfiguration!B44=\"\",\"\",Konfiguration!D44)","v":""},null,null,null,{"$f":"IF(B54=\"\",\"\",SUMIF(Ausgaben!B:B,B54,Ausgaben!A:A))","v":""},{"$f":"IF(B54=\"\",\"\",SUMIF(Einnahmen!B:B,B54,Einnahmen!A:A))","v":""}]
[null,{"$f":"IF(Konfiguration!B45=\"\",\"\",Konfiguration!B45)","v":""},null,null,null,{"$f":"IF(Konfiguration!B45=\"\",\"\",Konfiguration!C45)","v":""},{"$f":"IF(Konfiguration!B45=\"\",\"\",Konfiguration!D45)","v":""},null,null,null,{"$f":"IF(B55=\"\",\"\",SUMIF(Ausgaben!B:B,B55,Ausgaben!A:A))","v":""},{"$f":"IF(B55=\"\",\"\",SUMIF(Einnahmen!B:B,B55,Einnahmen!A:A))","v":""}]
[null,{"$f":"IF(Konfiguration!B46=\"\",\"\",Konfiguration!B46)","v":""},null,null,null,{"$f":"IF(Konfiguration!B46=\"\",\"\",Konfiguration!C46)","v":""},{"$f":"IF(Konfiguration!B46=\"\",\"\",Konfiguration!D46)","v":""},null,null,null,{"$f":"IF(B56=\"\",\"\",SUMIF(Ausgaben!B:B,B56,Ausgaben!A:A))","v":""},{"$f":"IF(B56=\"\",\"\",SUMIF(Einnahmen!B:B,B56,Einnahmen!A:A))","v":""}]
[null,{"$f":"IF(Konfiguration!B47=\"\",\"\",Konfiguration!B47)","v":""},null,null,null,{"$f":"IF(Konfiguration!B47=\"\",\"\",Konfiguration!C47)","v":""},{"$f":"IF(Konfiguration!B47=\"\",\"\",Konfiguration!D47)","v":""},null,null,null,{"$f":"IF(B57=\"\",\"\",SUMIF(Ausgaben!B:B,B57,Ausgaben!A:A))","v":""},{"$f":"IF(B57=\"\",\"\",SUMIF(Einnahmen!B:B,B57,Einnahmen!A:A))","v":""}]
[null,{"$f":"IF(Konfiguration!B48=\"\",\"\",Konfiguration!B48)","v":""},null,null,null,{"$f":"IF(Konfiguration!B48=\"\",\"\",Konfiguration!C48)","v":""},{"$f":"IF(Konfiguration!B48=\"\",\"\",Konfiguration!D48)","v":""},null,null,null,{"$f":"IF(B58=\"\",\"\",SUMIF(Ausgaben!B:B,B58,Ausgaben!A:A))","v":""},{"$f":"IF(B58=\"\",\"\",SUMIF(Einnahmen!B:B,B58,Einnahmen!A:A))","v":""}]
[null,{"$f":"IF(Konfiguration!B49=\"\",\"\",Konfiguration!B49)","v":""},null,null,null,{"$f":"IF(Konfiguration!B49=\"\",\"\",Konfiguration!C49)","v":""},{"$f":"IF(Konfiguration!B49=\"\",\"\",Konfiguration!D49)","v":""},null,null,null,{"$f":"IF(B59=\"\",\"\",SUMIF(Ausgaben!B:B,B59,Ausgaben!A:A))","v":""},{"$f":"IF(B59=\"\",\"\",SUMIF(Einnahmen!B:B,B59,Einnahmen!A:A))","v":""}]
[null,{"$f":"IF(Konfiguration!B50=\"\",\"\",Konfiguration!B50)","v":""},null,null,null,{"$f":"IF(Konfiguration!B50=\"\",\"\",Konfiguration!C50)","v":""},{"$f":"IF(Konfiguration!B50=\"\",\"\",Konfiguration!D50)","v":""},null,null,null,{"$f":"IF(B60=\"\",\"\",SUMIF(Ausgaben!B:B,B60,Ausgaben!A:A))","v":""},{"$f":"IF(B60=\"\",\"\",SUMIF(Einnahmen!B:B,B60,Einnahmen!A:A))","v":""}]
[null,{"$f":"IF(Konfiguration!B51=\"\",\"\",Konfiguration!B51)","v":""},null,null,null,{"$f":"IF(Konfiguration!B51=\"\",\"\",Konfiguration!C51)","v":""},{"$f":"IF(Konfiguration!B51=\"\",\"\",Konfiguration!D51)","v":""},null,null,null,{"$f":"IF(B61=\"\",\"\",SUMIF(Ausgaben!B:B,B61,Ausgaben!A:A))","v":""},{"$f":"IF(B61=\"\",\"\",SUMIF(Einnahmen!B:B,B61,Einnahmen!A:A))","v":""}]
[null,{"$f":"IF(Konfiguration!B52=\"\",\"\",Konfiguration!B52)","v":""},null,null,null,{"$f":"IF(Konfiguration!B52=\"\",\"\",Konfiguration!C52)","v":""},{"$f":"IF(Konfiguration!B52=\"\",\"\",Konfiguration!D52)","v":""},null,null,null,{"$f":"IF(B62=\"\",\"\",SUMIF(Ausgaben!B:B,B62,Ausgaben!A:A))","v":""},{"$f":"IF(B62=\"\",\"\",SUMIF(Einnahmen!B:B,B62,Einnahmen!A:A))","v":""}]
[null,{"$f":"IF(Konfiguration!B53=\"\",\"\",Konfiguration!B53)","v":""},null,null,null,{"$f":"IF(Konfiguration!B53=\"\",\"\",Konfiguration!C53)","v":""},{"$f":"IF(Konfiguration!B53=\"\",\"\",Konfiguration!D53)","v":""},null,null,null,{"$f":"IF(B63=\"\",\"\",SUMIF(Ausgaben!B:B,B63,Ausgaben!A:A))","v":""},{"$f":"IF(B63=\"\",\"\",SUMIF(Einnahmen!B:B,B63,Einnahmen!A:A))","v":""}]
[null,{"$f":"IF(Konfiguration!B54=\"\",\"\",Konfiguration!B54)","v":""},null,null,null,{"$f":"IF(Konfiguration!B54=\"\",\"\",Konfiguration!C54)","v":""},{"$f":"IF(Konfiguration!B54=\"\",\"\",Konfiguration!D54)","v":""},null,null,null,{"$f":"IF(B64=\"\",\"\",SUMIF(Ausgaben!B:B,B64,Ausgaben!A:A))","v":""},{"$f":"IF(B64=\"\",\"\",SUMIF(Einnahmen!B:B,B64,Einnahmen!A:A))","v":""}]
[null,{"$f":"IF(Konfiguration!B55=\"\",\"\",Konfiguration!B55)","v":""},null,null,null,{"$f":"IF(Konfiguration!B55=\"\",\"\",Konfiguration!C55)","v":""},{"$f":"IF(Konfiguration!B55=\"\",\"\",Konfiguration!D55)","v":""},null,null,null,{"$f":"IF(B65=\"\",\"\",SUMIF(Ausgaben!B:B,B65,Ausgaben!A:A))","v":""},{"$f":"IF(B65=\"\",\"\",SUMIF(Einnahmen!B:B,B65,Einnahmen!A:A))","v":""}]
[null,{"$f":"IF(Konfiguration!B56=\"\",\"\",Konfiguration!B56)","v":""},null,null,null,{"$f":"IF(Konfiguration!B56=\"\",\"\",Konfiguration!C56)","v":""},{"$f":"IF(Konfiguration!B56=\"\",\"\",Konfiguration!D56)","v":""},null,null,null,{"$f":"IF(B66=\"\",\"\",SUMIF(Ausgaben!B:B,B66,Ausgaben!A:A))","v":""},{"$f":"IF(B66=\"\",\"\",SUMIF(Einnahmen!B:B,B66,Einnahmen!A:A))","v":""}]
[null,{"$f":"IF(Konfiguration!B57=\"\",\"\",Konfiguration!B57)","v":""},null,null,null,{"$f":"IF(Konfiguration!B57=\"\",\"\",Konfiguration!C57)","v":""},{"$f":"IF(Konfiguration!B57=\"\",\"\",Konfiguration!D57)","v":""},null,null,null,{"$f":"IF(B67=\"\",\"\",SUMIF(Ausgaben!B:B,B67,Ausgaben!A:A))","v":""},{"$f":"IF(B67=\"\",\"\",SUMIF(Einnahmen!B:B,B67,Einnahmen!A:A))","v":""}]
[null,{"$f":"IF(Konfiguration!B58=\"\",\"\",Konfiguration!B58)","v":""},null,null,null,{"$f":"IF(Konfiguration!B58=\"\",\"\",Konfiguration!C58)","v":""},{"$f":"IF(Konfiguration!B58=\"\",\"\",Konfiguration!D58)","v":""},null,null,null,{"$f":"IF(B68=\"\",\"\",SUMIF(Ausgaben!B:B,B68,Ausgaben!A:A))","v":""},{"$f":"IF(B68=\"\",\"\",SUMIF(Einnahmen!B:B,B68,Einnahmen!A:A))","v":""}]
[null,{"$f":"IF(Konfiguration!B59=\"\",\"\",Konfiguration!B59)","v":""},null,null,null,{"$f":"IF(Konfiguration!B59=\"\",\"\",Konfiguration!C59)","v":""},{"$f":"IF(Konfiguration!B59=\"\",\"\",Konfiguration!D59)","v":""},null,null,null,{"$f":"IF(B69=\"\",\"\",SUMIF(Ausgaben!B:B,B69,Ausgaben!A:A))","v":""},{"$f":"IF(B69=\"\",\"\",SUMIF(Einnahmen!B:B,B69,Einnahmen!A:A))","v":""}]
[null,{"$f":"IF(Konfiguration!B60=\"\",\"\",Konfiguration!B60)","v":""},null,null,null,{"$f":"IF(Konfiguration!B60=\"\",\"\",Konfiguration!C60)","v":""},{"$f":"IF(Konfiguration!B60=\"\",\"\",Konfiguration!D60)","v":""},null,null,null,{"$f":"IF(B70=\"\",\"\",SUMIF(Ausgaben!B:B,B70,Ausgaben!A:A))","v":""},{"$f":"IF(B70=\"\",\"\",SUMIF(Einnahmen!B:B,B70,Einnahmen!A:A))","v":""}]
[null,{"$f":"IF(Konfiguration!B61=\"\",\"\",Konfiguration!B61)","v":""},null,null,null,{"$f":"IF(Konfiguration!B61=\"\",\"\",Konfiguration!C61)","v":""},{"$f":"IF(Konfiguration!B61=\"\",\"\",Konfiguration!D61)","v":""},null,null,null,{"$f":"IF(B71=\"\",\"\",SUMIF(Ausgaben!B:B,B71,Ausgaben!A:A))","v":""},{"$f":"IF(B71=\"\",\"\",SUMIF(Einnahmen!B:B,B71,Einnahmen!A:A))","v":""}]
[null,{"$f":"IF(Konfiguration!B62=\"\",\"\",Konfiguration!B62)","v":""},null,null,null,{"$f":"IF(Konfiguration!B62=\"\",\"\",Konfiguration!C62)","v":""},{"$f":"IF(Konfiguration!B62=\"\",\"\",Konfiguration!D62)","v":""},null,null,null,{"$f":"IF(B72=\"\",\"\",SUMIF(Ausgaben!B:B,B72,Ausgaben!A:A))","v":""},{"$f":"IF(B72=\"\",\"\",SUMIF(Einnahmen!B:B,B72,Einnahmen!A:A))","v":""}]
[null,{"$f":"IF(Konfiguration!B63=\"\",\"\",Konfiguration!B63)","v":""},null,null,null,{"$f":"IF(Konfiguration!B63=\"\",\"\",Konfiguration!C63)","v":""},{"$f":"IF(Konfiguration!B63=\"\",\"\",Konfiguration!D63)","v":""},null,null,null,{"$f":"IF(B73=\"\",\"\",SUMIF(Ausgaben!B:B,B73,Ausgaben!A:A))","v":""},{"$f":"IF(B73=\"\",\"\",SUMIF(Einnahmen!B:B,B73,Einnahmen!A:A))","v":""}]
[null,{"$f":"IF(Konfiguration!B64=\"\",\"\",Konfiguration!B64)","v":""},null,null,null,{"$f":"IF(Konfiguration!B64=\"\",\"\",Konfiguration!C64)","v":""},{"$f":"IF(Konfiguration!B64=\"\",\"\",Konfiguration!D64)","v":""},null,null,null,{"$f":"IF(B74=\"\",\"\",SUMIF(Ausgaben!B:B,B74,Ausgaben!A:A))","v":""},{"$f":"IF(B74=\"\",\"\",SUMIF(Einnahmen!B:B,B74,Einnahmen!A:A))","v":""}]
[null,{"$f":"IF(Konfiguration!B65=\"\",\"\",Konfiguration!B65)","v":""},null,null,null,{"$f":"IF(Konfiguration!B65=\"\",\"\",Konfiguration!C65)","v":""},{"$f":"IF(Konfiguration!B65=\"\",\"\",Konfiguration!D65)","v":""},null,null,null,{"$f":"IF(B75=\"\",\"\",SUMIF(Ausgaben!B:B,B75,Ausgaben!A:A))","v":""},{"$f":"IF(B75=\"\",\"\",SUMIF(Einnahmen!B:B,B75,Einnahmen!A:A))","v":""}]
[null,{"$f":"IF(Konfiguration!B66=\"\",\"\",Konfiguration!B66)","v":""},null,null,null,{"$f":"IF(Konfiguration!B66=\"\",\"\",Konfiguration!C66)","v":""},{"$f":"IF(Konfiguration!B66=\"\",\"\",Konfiguration!D66)","v":""},null,null,null,{"$f":"IF(B76=\"\",\"\",SUMIF(Ausgaben!B:B,B76,Ausgaben!A:A))","v":""},{"$f":"IF(B76=\"\",\"\",SUMIF(Einnahmen!B:B,B76,Einnahmen!A:A))","v":""}]
[null,{"$f":"IF(Konfiguration!B67=\"\",\"\",Konfiguration!B67)","v":""},null,null,null,{"$f":"IF(Konfiguration!B67=\"\",\"\",Konfiguration!C67)","v":""},{"$f":"IF(Konfiguration!B67=\"\",\"\",Konfiguration!D67)","v":""},null,null,null,{"$f":"IF(B77=\"\",\"\",SUMIF(Ausgaben!B:B,B77,Ausgaben!A:A))","v":""},{"$f":"IF(B77=\"\",\"\",SUMIF(Einnahmen!B:B,B77,Einnahmen!A:A))","v":""}]
[null,{"$f":"IF(Konfiguration!B68=\"\",\"\",Konfiguration!B68)","v":""},null,null,null,{"$f":"IF(Konfiguration!B68=\"\",\"\",Konfiguration!C68)","v":""},{"$f":"IF(Konfiguration!B68=\"\",\"\",Konfiguration!D68)","v":""},null,null,null,{"$f":"IF(B78=\"\",\"\",SUMIF(Ausgaben!B:B,B78,Ausgaben!A:A))","v":""},{"$f":"IF(B78=\"\",\"\",SUMIF(Einnahmen!B:B,B78,Einnahmen!A:A))","v":""}]
[null,{"$f":"IF(Konfiguration!B69=\"\",\"\",Konfiguration!B69)","v":""},null,null,null,{"$f":"IF(Konfiguration!B69=\"\",\"\",Konfiguration!C69)","v":""},{"$f":"IF(Konfiguration!B69=\"\",\"\",Konfiguration!D69)","v":""},null,null,null,{"$f":"IF(B79=\"\",\"\",SUMIF(Ausgaben!B:B,B79,Ausgaben!A:A))","v":""},{"$f":"IF(B79=\"\",\"\",SUMIF(Einnahmen!B:B,B79,Einnahmen!A:A))","v":""}]
[null,{"$f":"IF(Konfiguration!B70=\"\",\"\",Konfiguration!B70)","v":""},null,null,null,{"$f":"IF(Konfiguration!B70=\"\",\"\",Konfiguration!C70)","v":""},{"$f":"IF(Konfiguration!B70=\"\",\"\",Konfiguration!D70)","v":""},null,null,null,{"$f":"IF(B80=\"\",\"\",SUMIF(Ausgaben!B:B,B80,Ausgaben!A:A))","v":""},{"$f":"IF(B80=\"\",\"\",SUMIF(Einnahmen!B:B,B80,Einnahmen!A:A))","v":""}]
[null,{"$f":"IF(Konfiguration!B71=\"\",\"\",Konfiguration!B71)","v":""},null,null,null,{"$f":"IF(Konfiguration!B71=\"\",\"\",Konfiguration!C71)","v":""},{"$f":"IF(Konfiguration!B71=\"\",\"\",Konfiguration!D71)","v":""},null,null,null,{"$f":"IF(B81=\"\",\"\",SUMIF(Ausgaben!B:B,B81,Ausgaben!A:A))","v":""},{"$f":"IF(B81=\"\",\"\",SUMIF(Einnahmen!B:B,B81,Einnahmen!A:A))","v":""}]
[null,{"$f":"IF(Konfiguration!B72=\"\",\"\",Konfiguration!B72)","v":""},null,null,null,{"$f":"IF(Konfiguration!B72=\"\",\"\",Konfiguration!C72)","v":""},{"$f":"IF(Konfiguration!B72=\"\",\"\",Konfiguration!D72)","v":""},null,null,null,{"$f":"IF(B82=\"\",\"\",SUMIF(Ausgaben!B:B,B82,Ausgaben!A:A))","v":""},{"$f":"IF(B82=\"\",\"\",SUMIF(Einnahmen!B:B,B82,Einnahmen!A:A))","v":""}]
[null,{"$f":"IF(Konfiguration!B73=\"\",\"\",Konfiguration!B73)","v":""},null,null,null,{"$f":"IF(Konfiguration!B73=\"\",\"\",Konfiguration!C73)","v":""},{"$f":"IF(Konfiguration!B73=\"\",\"\",Konfiguration!D73)","v":""},null,null,null,{"$f":"IF(B83=\"\",\"\",SUMIF(Ausgaben!B:B,B83,Ausgaben!A:A))","v":""},{"$f":"IF(B83=\"\",\"\",SUMIF(Einnahmen!B:B,B83,Einnahmen!A:A))","v":""}]
[null,{"$f":"IF(Konfiguration!B74=\"\",\"\",Konfiguration!B74)","v":""},null,null,null,{"$f":"IF(Konfiguration!B74=\"\",\"\",Konfiguration!C74)","v":""},{"$f":"IF(Konfiguration!B74=\"\",\"\",Konfiguration!D74)","v":""},null,null,null,{"$f":"IF(B84=\"\",\"\",SUMIF(Ausgaben!B:B,B84,Ausgaben!A:A))","v":""},{"$f":"IF(B84=\"\",\"\",SUMIF(Einnahmen!B:B,B84,Einnahmen!A:A))","v":""}]
[null,{"$f":"IF(Konfiguration!B75=\"\",\"\",Konfiguration!B75)","v":""},null,null,null,{"$f":"IF(Konfiguration!B75=\"\",\"\",Konfiguration!C75)","v":""},{"$f":"IF(Konfiguration!B75=\"\",\"\",Konfiguration!D75)","v":""},null,null,null,{"$f":"IF(B85=\"\",\"\",SUMIF(Ausgaben!B:B,B85,Ausgaben!A:A))","v":""},{"$f":"IF(B85=\"\",\"\",SUMIF(Einnahmen!B:B,B85,Einnahmen!A:A))","v":""}]
[null,{"$f":"IF(Konfiguration!B76=\"\",\"\",Konfiguration!B76)","v":""},null,null,null,{"$f":"IF(Konfiguration!B76=\"\",\"\",Konfiguration!C76)","v":""},{"$f":"IF(Konfiguration!B76=\"\",\"\",Konfiguration!D76)","v":""},null,null,null,{"$f":"IF(B86=\"\",\"\",SUMIF(Ausgaben!B:B,B86,Ausgaben!A:A))","v":""},{"$f":"IF(B86=\"\",\"\",SUMIF(Einnahmen!B:B,B86,Einnahmen!A:A))","v":""}]
[null,{"$f":"IF(Konfiguration!B77=\"\",\"\",Konfiguration!B77)","v":""},null,null,null,{"$f":"IF(Konfiguration!B77=\"\",\"\",Konfiguration!C77)","v":""},{"$f":"IF(Konfiguration!B77=\"\",\"\",Konfiguration!D77)","v":""},null,null,null,{"$f":"IF(B87=\"\",\"\",SUMIF(Ausgaben!B:B,B87,Ausgaben!A:A))","v":""},{"$f":"IF(B87=\"\",\"\",SUMIF(Einnahmen!B:B,B87,Einnahmen!A:A))","v":""}]
[null,{"$f":"IF(Konfiguration!B78=\"\",\"\",Konfiguration!B78)","v":""},null,null,null,{"$f":"IF(Konfiguration!B78=\"\",\"\",Konfiguration!C78)","v":""},{"$f":"IF(Konfiguration!B78=\"\",\"\",Konfiguration!D78)","v":""},null,null,null,{"$f":"IF(B88=\"\",\"\",SUMIF(Ausgaben!B:B,B88,Ausgaben!A:A))","v":""},{"$f":"IF(B88=\"\",\"\",SUMIF(Einnahmen!B:B,B88,Einnahmen!A:A))","v":""}]
[null,{"$f":"IF(Konfiguration!B79=\"\",\"\",Konfiguration!B79)","v":""},null,null,null,{"$f":"IF(Konfiguration!B79=\"\",\"\",Konfiguration!C79)","v":""},{"$f":"IF(Konfiguration!B79=\"\",\"\",Konfiguration!D79)","v":""},null,null,null,{"$f":"IF(B89=\"\",\"\",SUMIF(Ausgaben!B:B,B89,Ausgaben!A:A))","v":""},{"$f":"IF(B89=\"\",\"\",SUMIF(Einnahmen!B:B,B89,Einnahmen!A:A))","v":""}]
[null,{"$f":"IF(Konfiguration!B80=\"\",\"\",Konfiguration!B80)","v":""},null,null,null,{"$f":"IF(Konfiguration!B80=\"\",\"\",Konfiguration!C80)","v":""},{"$f":"IF(Konfiguration!B80=\"\",\"\",Konfiguration!D80)","v":""},null,null,null,{"$f":"IF(B90=\"\",\"\",SUMIF(Ausgaben!B:B,B90,Ausgaben!A:A))","v":""},{"$f":"IF(B90=\"\",\"\",SUMIF(Einnahmen!B:B,B90,Einnahmen!A:A))","v":""}]
[null,{"$f":"IF(Konfiguration!B81=\"\",\"\",Konfiguration!B81)","v":""},null,null,null,{"$f":"IF(Konfiguration!B81=\"\",\"\",Konfiguration!C81)","v":""},{"$f":"IF(Konfiguration!B81=\"\",\"\",Konfiguration!D81)","v":""},null,null,null,{"$f":"IF(B91=\"\",\"\",SUMIF(Ausgaben!B:B,B91,Ausgaben!A:A))","v":""},{"$f":"IF(B91=\"\",\"\",SUMIF(Einnahmen!B:B,B91,Einnahmen!A:A))","v":""}]
[null,{"$f":"IF(Konfiguration!B82=\"\",\"\",Konfiguration!B82)","v":""},null,null,null,{"$f":"IF(Konfiguration!B82=\"\",\"\",Konfiguration!C82)","v":""},{"$f":"IF(Konfiguration!B82=\"\",\"\",Konfiguration!D82)","v":""},null,null,null,{"$f":"IF(B92=\"\",\"\",SUMIF(Ausgaben!B:B,B92,Ausgaben!A:A))","v":""},{"$f":"IF(B92=\"\",\"\",SUMIF(Einnahmen!B:B,B92,Einnahmen!A:A))","v":""}]
[null,{"$f":"IF(Konfiguration!B83=\"\",\"\",Konfiguration!B83)","v":""},null,null,null,{"$f":"IF(Konfiguration!B83=\"\",\"\",Konfiguration!C83)","v":""},{"$f":"IF(Konfiguration!B83=\"\",\"\",Konfiguration!D83)","v":""},null,null,null,{"$f":"IF(B93=\"\",\"\",SUMIF(Ausgaben!B:B,B93,Ausgaben!A:A))","v":""},{"$f":"IF(B93=\"\",\"\",SUMIF(Einnahmen!B:B,B93,Einnahmen!A:A))","v":""}]
[null,{"$f":"IF(Konfiguration!B84=\"\",\"\",Konfiguration!B84)","v":""},null,null,null,{"$f":"IF(Konfiguration!B84=\"\",\"\",Konfiguration!C84)","v":""},{"$f":"IF(Konfiguration!B84=\"\",\"\",Konfiguration!D84)","v":""},null,null,null,{"$f":"IF(B94=\"\",\"\",SUMIF(Ausgaben!B:B,B94,Ausgaben!A:A))","v":""},{"$f":"IF(B94=\"\",\"\",SUMIF(Einnahmen!B:B,B94,Einnahmen!A:A))","v":""}]
[null,{"$f":"IF(Konfiguration!B85=\"\",\"\",Konfiguration!B85)","v":""},null,null,null,{"$f":"IF(Konfiguration!B85=\"\",\"\",Konfiguration!C85)","v":""},{"$f":"IF(Konfiguration!B85=\"\",\"\",Konfiguration!D85)","v":""},null,null,null,{"$f":"IF(B95=\"\",\"\",SUMIF(Ausgaben!B:B,B95,Ausgaben!A:A))","v":""},{"$f":"IF(B95=\"\",\"\",SUMIF(Einnahmen!B:B,B95,Einnahmen!A:A))","v":""}]
[null,{"$f":"IF(Konfiguration!B86=\"\",\"\",Konfiguration!B86)","v":""},null,null,null,{"$f":"IF(Konfiguration!B86=\"\",\"\",Konfiguration!C86)","v":""},{"$f":"IF(Konfiguration!B86=\"\",\"\",Konfiguration!D86)","v":""},null,null,null,{"$f":"IF(B96=\"\",\"\",SUMIF(Ausgaben!B:B,B96,Ausgaben!A:A))","v":""},{"$f":"IF(B96=\"\",\"\",SUMIF(Einnahmen!B:B,B96,Einnahmen!A:A))","v":""}]
[null,{"$f":"IF(Konfiguration!B87=\"\",\"\",Konfiguration!B87)","v":""},null,null,null,{"$f":"IF(Konfiguration!B87=\"\",\"\",Konfiguration!C87)","v":""},{"$f":"IF(Konfiguration!B87=\"\",\"\",Konfiguration!D87)","v":""},null,null,null,{"$f":"IF(B97=\"\",\"\",SUMIF(Ausgaben!B:B,B97,Ausgaben!A:A))","v":""},{"$f":"IF(B97=\"\",\"\",SUMIF(Einnahmen!B:B,B97,Einnahmen!A:A))","v":""}]
[null,{"$f":"IF(Konfiguration!B88=\"\",\"\",Konfiguration!B88)","v":""},null,null,null,{"$f":"IF(Konfiguration!B88=\"\",\"\",Konfiguration!C88)","v":""},{"$f":"IF(Konfiguration!B88=\"\",\"\",Konfiguration!D88)","v":""},null,null,null,{"$f":"IF(B98=\"\",\"\",SUMIF(Ausgaben!B:B,B98,Ausgaben!A:A))","v":""},{"$f":"IF(B98=\"\",\"\",SUMIF(Einnahmen!B:B,B98,Einnahmen!A:A))","v":""}]
[null,{"$f":"IF(Konfiguration!B89=\"\",\"\",Konfiguration!B89)","v":""},null,null,null,{"$f":"IF(Konfiguration!B89=\"\",\"\",Konfiguration!C89)","v":""},{"$f":"IF(Konfiguration!B89=\"\",\"\",Konfiguration!D89)","v":""},null,null,null,{"$f":"IF(B99=\"\",\"\",SUMIF(Ausgaben!B:B,B99,Ausgaben!A:A))","v":""},{"$f":"IF(B99=\"\",\"\",SUMIF(Einnahmen!B:B,B99,Einnahmen!A:A))","v":""}]
[null,{"$f":"IF(Konfiguration!B90=\"\",\"\",Konfiguration!B90)","v":""},null,null,null,{"$f":"IF(Konfiguration!B90=\"\",\"\",Konfiguration!C90)","v":""},{"$f":"IF(Konfiguration!B90=\"\",\"\",Konfiguration!D90)","v":""},null,null,null,{"$f":"IF(B100=\"\",\"\",SUMIF(Ausgaben!B:B,B100,Ausgaben!A:A))","v":""},{"$f":"IF(B100=\"\",\"\",SUMIF(Einnahmen!B:B,B100,Einnahmen!A:A))","v":""}]
[null,{"$f":"IF(Konfiguration!B91=\"\",\"\",Konfiguration!B91)","v":""},null,null,null,{"$f":"IF(Konfiguration!B91=\"\",\"\",Konfiguration!C91)","v":""},{"$f":"IF(Konfiguration!B91=\"\",\"\",Konfiguration!D91)","v":""},null,null,null,{"$f":"IF(B101=\"\",\"\",SUMIF(Ausgaben!B:B,B101,Ausgaben!A:A))","v":""},{"$f":"IF(B101=\"\",\"\",SUMIF(Einnahmen!B:B,B101,Einnahmen!A:A))","v":""}]
[null,{"$f":"IF(Konfiguration!B92=\"\",\"\",Konfiguration!B92)","v":""},null,null,null,{"$f":"IF(Konfiguration!B92=\"\",\"\",Konfiguration!C92)","v":""},{"$f":"IF(Konfiguration!B92=\"\",\"\",Konfiguration!D92)","v":""},null,null,null,{"$f":"IF(B102=\"\",\"\",SUMIF(Ausgaben!B:B,B102,Ausgaben!A:A))","v":""},{"$f":"IF(B102=\"\",\"\",SUMIF(Einnahmen!B:B,B102,Einnahmen!A:A))","v":""}]
[null,{"$f":"IF(Konfiguration!B93=\"\",\"\",Konfiguration!B93)","v":""},null,null,null,{"$f":"IF(Konfiguration!B93=\"\",\"\",Konfiguration!C93)","v":""},{"$f":"IF(Konfiguration!B93=\"\",\"\",Konfiguration!D93)","v":""},null,null,null,{"$f":"IF(B103=\"\",\"\",SUMIF(Ausgaben!B:B,B103,Ausgaben!A:A))","v":""},{"$f":"IF(B103=\"\",\"\",SUMIF(Einnahmen!B:B,B103,Einnahmen!A:A))","v":""}]
[null,{"$f":"IF(Konfiguration!B94=\"\",\"\",Konfiguration!B94)","v":""},null,null,null,{"$f":"IF(Konfiguration!B94=\"\",\"\",Konfiguration!C94)","v":""},{"$f":"IF(Konfiguration!B94=\"\",\"\",Konfiguration!D94)","v":""},null,null,null,{"$f":"IF(B104=\"\",\"\",SUMIF(Ausgaben!B:B,B104,Ausgaben!A:A))","v":""},{"$f":"IF(B104=\"\",\"\",SUMIF(Einnahmen!B:B,B104,Einnahmen!A:A))","v":""}]
[null,{"$f":"IF(Konfiguration!B95=\"\",\"\",Konfiguration!B95)","v":""},null,null,null,{"$f":"IF(Konfiguration!B95=\"\",\"\",Konfiguration!C95)","v":""},{"$f":"IF(Konfiguration!B95=\"\",\"\",Konfiguration!D95)","v":""},null,null,null,{"$f":"IF(B105=\"\",\"\",SUMIF(Ausgaben!B:B,B105,Ausgaben!A:A))","v":""},{"$f":"IF(B105=\"\",\"\",SUMIF(Einnahmen!B:B,B105,Einnahmen!A:A))","v":""}]
[null,{"$f":"IF(Konfiguration!B96=\"\",\"\",Konfiguration!B96)","v":""},null,null,null,{"$f":"IF(Konfiguration!B96=\"\",\"\",Konfiguration!C96)","v":""},{"$f":"IF(Konfiguration!B96=\"\",\"\",Konfiguration!D96)","v":""},null,null,null,{"$f":"IF(B106=\"\",\"\",SUMIF(Ausgaben!B:B,B106,Ausgaben!A:A))","v":""},{"$f":"IF(B106=\"\",\"\",SUMIF(Einnahmen!B:B,B106,Einnahmen!A:A))","v":""}]
[null,{"$f":"IF(Konfiguration!B97=\"\",\"\",Konfiguration!B97)","v":""},null,null,null,{"$f":"IF(Konfiguration!B97=\"\",\"\",Konfiguration!C97)","v":""},{"$f":"IF(Konfiguration!B97=\"\",\"\",Konfiguration!D97)","v":""},null,null,null,{"$f":"IF(B107=\"\",\"\",SUMIF(Ausgaben!B:B,B107,Ausgaben!A:A))","v":""},{"$f":"IF(B107=\"\",\"\",SUMIF(Einnahmen!B:B,B107,Einnahmen!A:A))","v":""}]
[null,{"$f":"IF(Konfiguration!B98=\"\",\"\",Konfiguration!B98)","v":""},null,null,null,{"$f":"IF(Konfiguration!B98=\"\",\"\",Konfiguration!C98)","v":""},{"$f":"IF(Konfiguration!B98=\"\",\"\",Konfiguration!D98)","v":""},null,null,null,{"$f":"IF(B108=\"\",\"\",SUMIF(Ausgaben!B:B,B108,Ausgaben!A:A))","v":""},{"$f":"IF(B108=\"\",\"\",SUMIF(Einnahmen!B:B,B108,Einnahmen!A:A))","v":""}]
[null,{"$f":"IF(Konfiguration!B99=\"\",\"\",Konfiguration!B99)","v":""},null,null,null,{"$f":"IF(Konfiguration!B99=\"\",\"\",Konfiguration!C99)","v":""},{"$f":"IF(Konfiguration!B99=\"\",\"\",Konfiguration!D99)","v":""},null,null,null,{"$f":"IF(B109=\"\",\"\",SUMIF(Ausgaben!B:B,B109,Ausgaben!A:A))","v":""},{"$f":"IF(B109=\"\",\"\",SUMIF(Einnahmen!B:B,B109,Einnahmen!A:A))","v":""}]
[null,{"$f":"IF(Konfiguration!B100=\"\",\"\",Konfiguration!B100)","v":""},null,null,null,{"$f":"IF(Konfiguration!B100=\"\",\"\",Konfiguration!C100)","v":""},{"$f":"IF(Konfiguration!B100=\"\",\"\",Konfiguration!D100)","v":""},null,null,null,{"$f":"IF(B110=\"\",\"\",SUMIF(Ausgaben!B:B,B110,Ausgaben!A:A))","v":""},{"$f":"IF(B110=\"\",\"\",SUMIF(Einnahmen!B:B,B110,Einnahmen!A:A))","v":""}]
[null,{"$f":"IF(Konfiguration!B101=\"\",\"\",Konfiguration!B101)","v":""},null,null,null,{"$f":"IF(Konfiguration!B101=\"\",\"\",Konfiguration!C101)","v":""},{"$f":"IF(Konfiguration!B101=\"\",\"\",Konfiguration!D101)","v":""},null,null,null,{"$f":"IF(B111=\"\",\"\",SUMIF(Ausgaben!B:B,B111,Ausgaben!A:A))","v":""},{"$f":"IF(B111=\"\",\"\",SUMIF(Einnahmen!B:B,B111,Einnahmen!A:A))","v":""}]
[null,{"$f":"IF(Konfiguration!B102=\"\",\"\",Konfiguration!B102)","v":""},null,null,null,{"$f":"IF(Konfiguration!B102=\"\",\"\",Konfiguration!C102)","v":""},{"$f":"IF(Konfiguration!B102=\"\",\"\",Konfiguration!D102)","v":""},null,null,null,{"$f":"IF(B112=\"\",\"\",SUMIF(Ausgaben!B:B,B112,Ausgaben!A:A))","v":""},{"$f":"IF(B112=\"\",\"\",SUMIF(Einnahmen!B:B,B112,Einnahmen!A:A))","v":""}]
[null,{"$f":"IF(Konfiguration!B103=\"\",\"\",Konfiguration!B103)","v":""},null,null,null,{"$f":"IF(Konfiguration!B103=\"\",\"\",Konfiguration!C103)","v":""},{"$f":"IF(Konfiguration!B103=\"\",\"\",Konfiguration!D103)","v":""},null,null,null,{"$f":"IF(B113=\"\",\"\",SUMIF(Ausgaben!B:B,B113,Ausgaben!A:A))","v":""},{"$f":"IF(B113=\"\",\"\",SUMIF(Einnahmen!B:B,B113,Einnahmen!A:A))","v":""}]
[null,{"$f":"IF(Konfiguration!B104=\"\",\"\",Konfiguration!B104)","v":""},null,null,null,{"$f":"IF(Konfiguration!B104=\"\",\"\",Konfiguration!C104)","v":""},{"$f":"IF(Konfiguration!B104=\"\",\"\",Konfiguration!D104)","v":""},null,null,null,{"$f":"IF(B114=\"\",\"\",SUMIF(Ausgaben!B:B,B114,Ausgaben!A:A))","v":""},{"$f":"IF(B114=\"\",\"\",SUMIF(Einnahmen!B:B,B114,Einnahmen!A:A))","v":""}]
[null,{"$f":"IF(Konfiguration!B105=\"\",\"\",Konfiguration!B105)","v":""},null,null,null,{"$f":"IF(Konfiguration!B105=\"\",\"\",Konfiguration!C105)","v":""},{"$f":"IF(Konfiguration!B105=\"\",\"\",Konfiguration!D105)","v":""},null,null,null,{"$f":"IF(B115=\"\",\"\",SUMIF(Ausgaben!B:B,B115,Ausgaben!A:A))","v":""},{"$f":"IF(B115=\"\",\"\",SUMIF(Einnahmen!B:B,B115,Einnahmen!A:A))","v":""}]
[null,{"$f":"IF(Konfiguration!B106=\"\",\"\",Konfiguration!B106)","v":""},null,null,null,{"$f":"IF(Konfiguration!B106=\"\",\"\",Konfiguration!C106)","v":""},{"$f":"IF(Konfiguration!B106=\"\",\"\",Konfiguration!D106)","v":""},null,null,null,{"$f":"IF(B116=\"\",\"\",SUMIF(Ausgaben!B:B,B116,Ausgaben!A:A))","v":""},{"$f":"IF(B116=\"\",\"\",SUMIF(Einnahmen!B:B,B116,Einnahmen!A:A))","v":""}]
[null,{"$f":"IF(Konfiguration!B107=\"\",\"\",Konfiguration!B107)","v":""},null,null,null,{"$f":"IF(Konfiguration!B107=\"\",\"\",Konfiguration!C107)","v":""},{"$f":"IF(Konfiguration!B107=\"\",\"\",Konfiguration!D107)","v":""},null,null,null,{"$f":"IF(B117=\"\",\"\",SUMIF(Ausgaben!B:B,B117,Ausgaben!A:A))","v":""},{"$f":"IF(B117=\"\",\"\",SUMIF(Einnahmen!B:B,B117,Einnahmen!A:A))","v":""}]
[null,{"$f":"IF(Konfiguration!B108=\"\",\"\",Konfiguration!B108)","v":""},null,null,null,{"$f":"IF(Konfiguration!B108=\"\",\"\",Konfiguration!C108)","v":""},{"$f":"IF(Konfiguration!B108=\"\",\"\",Konfiguration!D108)","v":""},null,null,null,{"$f":"IF(B118=\"\",\"\",SUMIF(Ausgaben!B:B,B118,Ausgaben!A:A))","v":""},{"$f":"IF(B118=\"\",\"\",SUMIF(Einnahmen!B:B,B118,Einnahmen!A:A))","v":""}]
[null,{"$f":"IF(Konfiguration!B109=\"\",\"\",Konfiguration!B109)","v":""},null,null,null,{"$f":"IF(Konfiguration!B109=\"\",\"\",Konfiguration!C109)","v":""},{"$f":"IF(Konfiguration!B109=\"\",\"\",Konfiguration!D109)","v":""},null,null,null,{"$f":"IF(B119=\"\",\"\",SUMIF(Ausgaben!B:B,B119,Ausgaben!A:A))","v":""},{"$f":"IF(B119=\"\",\"\",SUMIF(Einnahmen!B:B,B119,Einnahmen!A:A))","v":""}]
[null,{"$f":"IF(Konfiguration!B110=\"\",\"\",Konfiguration!B110)","v":""},null,null,null,{"$f":"IF(Konfiguration!B110=\"\",\"\",Konfiguration!C110)","v":""},{"$f":"IF(Konfiguration!B110=\"\",\"\",Konfiguration!D110)","v":""},null,null,null,{"$f":"IF(B120=\"\",\"\",SUMIF(Ausgaben!B:B,B120,Ausgaben!A:A))","v":""},{"$f":"IF(B120=\"\",\"\",SUMIF(Einnahmen!B:B,B120,Einnahmen!A:A))","v":""}]
[null,{"$f":"IF(Konfiguration!B111=\"\",\"\",Konfiguration!B111)","v":""},null,null,null,{"$f":"IF(Konfiguration!B111=\"\",\"\",Konfiguration!C111)","v":""},{"$f":"IF(Konfiguration!B111=\"\",\"\",Konfiguration!D111)","v":""},null,null,null,{"$f":"IF(B121=\"\",\"\",SUMIF(Ausgaben!B:B,B121,Ausgaben!A:A))","v":""},{"$f":"IF(B121=\"\",\"\",SUMIF(Einnahmen!B:B,B121,Einnahmen!A:A))","v":""}]
[null,{"$f":"IF(Konfiguration!B112=\"\",\"\",Konfiguration!B112)","v":""},null,null,null,{"$f":"IF(Konfiguration!B112=\"\",\"\",Konfiguration!C112)","v":""},{"$f":"IF(Konfiguration!B112=\"\",\"\",Konfiguration!D112)","v":""},null,null,null,{"$f":"IF(B122=\"\",\"\",SUMIF(Ausgaben!B:B,B122,Ausgaben!A:A))","v":""},{"$f":"IF(B122=\"\",\"\",SUMIF(Einnahmen!B:B,B122,Einnahmen!A:A))","v":""}]
[null,{"$f":"IF(Konfiguration!B113=\"\",\"\",Konfiguration!B113)","v":""},null,null,null,{"$f":"IF(Konfiguration!B113=\"\",\"\",Konfiguration!C113)","v":""},{"$f":"IF(Konfiguration!B113=\"\",\"\",Konfiguration!D113)","v":""},null,null,null,{"$f":"IF(B123=\"\",\"\",SUMIF(Ausgaben!B:B,B123,Ausgaben!A:A))","v":""},{"$f":"IF(B123=\"\",\"\",SUMIF(Einnahmen!B:B,B123,Einnahmen!A:A))","v":""}]
[null,{"$f":"IF(Konfiguration!B114=\"\",\"\",Konfiguration!B114)","v":""},null,null,null,{"$f":"IF(Konfiguration!B114=\"\",\"\",Konfiguration!C114)","v":""},{"$f":"IF(Konfiguration!B114=\"\",\"\",Konfiguration!D114)","v":""},null,null,null,{"$f":"IF(B124=\"\",\"\",SUMIF(Ausgaben!B:B,B124,Ausgaben!A:A))","v":""},{"$f":"IF(B124=\"\",\"\",SUMIF(Einnahmen!B:B,B124,Einnahmen!A:A))","v":""}]
[null,{"$f":"IF(Konfiguration!B115=\"\",\"\",Konfiguration!B115)","v":""},null,null,null,{"$f":"IF(Konfiguration!B115=\"\",\"\",Konfiguration!C115)","v":""},{"$f":"IF(Konfiguration!B115=\"\",\"\",Konfiguration!D115)","v":""},null,null,null,{"$f":"IF(B125=\"\",\"\",SUMIF(Ausgaben!B:B,B125,Ausgaben!A:A))","v":""},{"$f":"IF(B125=\"\",\"\",SUMIF(Einnahmen!B:B,B125,Einnahmen!A:A))","v":""}]
[null,{"$f":"IF(Konfiguration!B116=\"\",\"\",Konfiguration!B116)","v":""},null,null,null,{"$f":"IF(Konfiguration!B116=\"\",\"\",Konfiguration!C116)","v":""},{"$f":"IF(Konfiguration!B116=\"\",\"\",Konfiguration!D116)","v":""},null,null,null,{"$f":"IF(B126=\"\",\"\",SUMIF(Ausgaben!B:B,B126,Ausgaben!A:A))","v":""},{"$f":"IF(B126=\"\",\"\",SUMIF(Einnahmen!B:B,B126,Einnahmen!A:A))","v":""}]
[null,{"$f":"IF(Konfiguration!B117=\"\",\"\",Konfiguration!B117)","v":""},null,null,null,{"$f":"IF(Konfiguration!B117=\"\",\"\",Konfiguration!C117)","v":""},{"$f":"IF(Konfiguration!B117=\"\",\"\",Konfiguration!D117)","v":""},null,null,null,{"$f":"IF(B127=\"\",\"\",SUMIF(Ausgaben!B:B,B127,Ausgaben!A:A))","v":""},{"$f":"IF(B127=\"\",\"\",SUMIF(Einnahmen!B:B,B127,Einnahmen!A:A))","v":""}]
[null,{"$f":"IF(Konfiguration!B118=\"\",\"\",Konfiguration!B118)","v":""},null,null,null,{"$f":"IF(Konfiguration!B118=\"\",\"\",Konfiguration!C118)","v":""},{"$f":"IF(Konfiguration!B118=\"\",\"\",Konfiguration!D118)","v":""},null,null,null,{"$f":"IF(B128=\"\",\"\",SUMIF(Ausgaben!B:B,B128,Ausgaben!A:A))","v":""},{"$f":"IF(B128=\"\",\"\",SUMIF(Einnahmen!B:B,B128,Einnahmen!A:A))","v":""}]
[null,{"$f":"IF(Konfiguration!B119=\"\",\"\",Konfiguration!B119)","v":""},null,null,null,{"$f":"IF(Konfiguration!B119=\"\",\"\",Konfiguration!C119)","v":""},{"$f":"IF(Konfiguration!B119=\"\",\"\",Konfiguration!D119)","v":""},null,null,null,{"$f":"IF(B129=\"\",\"\",SUMIF(Ausgaben!B:B,B129,Ausgaben!A:A))","v":""},{"$f":"IF(B129=\"\",\"\",SUMIF(Einnahmen!B:B,B129,Einnahmen!A:A))","v":""}]
[null,{"$f":"IF(Konfiguration!B120=\"\",\"\",Konfiguration!B120)","v":""},null,null,null,{"$f":"IF(Konfiguration!B120=\"\",\"\",Konfiguration!C120)","v":""},{"$f":"IF(Konfiguration!B120=\"\",\"\",Konfiguration!D120)","v":""},null,null,null,{"$f":"IF(B130=\"\",\"\",SUMIF(Ausgaben!B:B,B130,Ausgaben!A:A))","v":""},{"$f":"IF(B130=\"\",\"\",SUMIF(Einnahmen!B:B,B130,Einnahmen!A:A))","v":""}]
[null,{"$f":"IF(Konfiguration!B121=\"\",\"\",Konfiguration!B121)","v":""},null,null,null,{"$f":"IF(Konfiguration!B121=\"\",\"\",Konfiguration!C121)","v":""},{"$f":"IF(Konfiguration!B121=\"\",\"\",Konfiguration!D121)","v":""},null,null,null,{"$f":"IF(B131=\"\",\"\",SUMIF(Ausgaben!B:B,B131,Ausgaben!A:A))","v":""},{"$f":"IF(B131=\"\",\"\",SUMIF(Einnahmen!B:B,B131,Einnahmen!A:A))","v":""}]
[null,{"$f":"IF(Konfiguration!B122=\"\",\"\",Konfiguration!B122)","v":""},null,null,null,{"$f":"IF(Konfiguration!B122=\"\",\"\",Konfiguration!C122)","v":""},{"$f":"IF(Konfiguration!B122=\"\",\"\",Konfiguration!D122)","v":""},null,null,null,{"$f":"IF(B132=\"\",\"\",SUMIF(Ausgaben!B:B,B132,Ausgaben!A:A))","v":""},{"$f":"IF(B132=\"\",\"\",SUMIF(Einnahmen!B:B,B132,Einnahmen!A:A))","v":""}]
[null,{"$f":"IF(Konfiguration!B123=\"\",\"\",Konfiguration!B123)","v":""},null,null,null,{"$f":"IF(Konfiguration!B123=\"\",\"\",Konfiguration!C123)","v":""},{"$f":"IF(Konfiguration!B123=\"\",\"\",Konfiguration!D123)","v":""},null,null,null,{"$f":"IF(B133=\"\",\"\",SUMIF(Ausgaben!B:B,B133,Ausgaben!A:A))","v":""},{"$f":"IF(B133=\"\",\"\",SUMIF(Einnahmen!B:B,B133,Einnahmen!A:A))","v":""}]
[null,{"$f":"IF(Konfiguration!B124=\"\",\"\",Konfiguration!B124)","v":""},null,null,null,{"$f":"IF(Konfiguration!B124=\"\",\"\",Konfiguration!C124)","v":""},{"$f":"IF(Konfiguration!B124=\"\",\"\",Konfiguration!D124)","v":""},null,null,null,{"$f":"IF(B134=\"\",\"\",SUMIF(Ausgaben!B:B,B134,Ausgaben!A:A))","v":""},{"$f":"IF(B134=\"\",\"\",SUMIF(Einnahmen!B:B,B134,Einnahmen!A:A))","v":""}]
[null,{"$f":"IF(Konfiguration!B125=\"\",\"\",Konfiguration!B125)","v":""},null,null,null,{"$f":"IF(Konfiguration!B125=\"\",\"\",Konfiguration!C125)","v":""},{"$f":"IF(Konfiguration!B125=\"\",\"\",Konfiguration!D125)","v":""},null,null,null,{"$f":"IF(B135=\"\",\"\",SUMIF(Ausgaben!B:B,B135,Ausgaben!A:A))","v":""},{"$f":"IF(B135=\"\",\"\",SUMIF(Einnahmen!B:B,B135,Einnahmen!A:A))","v":""}]
[null,{"$f":"IF(Konfiguration!B126=\"\",\"\",Konfiguration!B126)","v":""},null,null,null,{"$f":"IF(Konfiguration!B126=\"\",\"\",Konfiguration!C126)","v":""},{"$f":"IF(Konfiguration!B126=\"\",\"\",Konfiguration!D126)","v":""},null,null,null,{"$f":"IF(B136=\"\",\"\",SUMIF(Ausgaben!B:B,B136,Ausgaben!A:A))","v":""},{"$f":"IF(B136=\"\",\"\",SUMIF(Einnahmen!B:B,B136,Einnahmen!A:A))","v":""}]
[null,{"$f":"IF(Konfiguration!B127=\"\",\"\",Konfiguration!B127)","v":""},null,null,null,{"$f":"IF(Konfiguration!B127=\"\",\"\",Konfiguration!C127)","v":""},{"$f":"IF(Konfiguration!B127=\"\",\"\",Konfiguration!D127)","v":""},null,null,null,{"$f":"IF(B137=\"\",\"\",SUMIF(Ausgaben!B:B,B137,Ausgaben!A:A))","v":""},{"$f":"IF(B137=\"\",\"\",SUMIF(Einnahmen!B:B,B137,Einnahmen!A:A))","v":""}]
[null,{"$f":"IF(Konfiguration!B128=\"\",\"\",Konfiguration!B128)","v":""},null,null,null,{"$f":"IF(Konfiguration!B128=\"\",\"\",Konfiguration!C128)","v":""},{"$f":"IF(Konfiguration!B128=\"\",\"\",Konfiguration!D128)","v":""},null,null,null,{"$f":"IF(B138=\"\",\"\",SUMIF(Ausgaben!B:B,B138,Ausgaben!A:A))","v":""},{"$f":"IF(B138=\"\",\"\",SUMIF(Einnahmen!B:B,B138,Einnahmen!A:A))","v":""}]
[null,{"$f":"IF(Konfiguration!B129=\"\",\"\",Konfiguration!B129)","v":""},null,null,null,{"$f":"IF(Konfiguration!B129=\"\",\"\",Konfiguration!C129)","v":""},{"$f":"IF(Konfiguration!B129=\"\",\"\",Konfiguration!D129)","v":""},null,null,null,{"$f":"IF(B139=\"\",\"\",SUMIF(Ausgaben!B:B,B139,Ausgaben!A:A))","v":""},{"$f":"IF(B139=\"\",\"\",SUMIF(Einnahmen!B:B,B139,Einnahmen!A:A))","v":""}]
[null,{"$f":"IF(Konfiguration!B130=\"\",\"\",Konfiguration!B130)","v":""},null,null,null,{"$f":"IF(Konfiguration!B130=\"\",\"\",Konfiguration!C130)","v":""},{"$f":"IF(Konfiguration!B130=\"\",\"\",Konfiguration!D130)","v":""},null,null,null,{"$f":"IF(B140=\"\",\"\",SUMIF(Ausgaben!B:B,B140,Ausgaben!A:A))","v":""},{"$f":"IF(B140=\"\",\"\",SUMIF(Einnahmen!B:B,B140,Einnahmen!A:A))","v":""}]
[null,{"$f":"IF(Konfiguration!B131=\"\",\"\",Konfiguration!B131)","v":""},null,null,null,{"$f":"IF(Konfiguration!B131=\"\",\"\",Konfiguration!C131)","v":""},{"$f":"IF(Konfiguration!B131=\"\",\"\",Konfiguration!D131)","v":""},null,null,null,{"$f":"IF(B141=\"\",\"\",SUMIF(Ausgaben!B:B,B141,Ausgaben!A:A))","v":""},{"$f":"IF(B141=\"\",\"\",SUMIF(Einnahmen!B:B,B141,Einnahmen!A:A))","v":""}]
[null,{"$f":"IF(Konfiguration!B132=\"\",\"\",Konfiguration!B132)","v":""},null,null,null,{"$f":"IF(Konfiguration!B132=\"\",\"\",Konfiguration!C132)","v":""},{"$f":"IF(Konfiguration!B132=\"\",\"\",Konfiguration!D132)","v":""},null,null,null,{"$f":"IF(B142=\"\",\"\",SUMIF(Ausgaben!B:B,B142,Ausgaben!A:A))","v":""},{"$f":"IF(B142=\"\",\"\",SUMIF(Einnahmen!B:B,B142,Einnahmen!A:A))","v":""}]
[null,{"$f":"IF(Konfiguration!B133=\"\",\"\",Konfiguration!B133)","v":""},null,null,null,{"$f":"IF(Konfiguration!B133=\"\",\"\",Konfiguration!C133)","v":""},{"$f":"IF(Konfiguration!B133=\"\",\"\",Konfiguration!D133)","v":""},null,null,null,{"$f":"IF(B143=\"\",\"\",SUMIF(Ausgaben!B:B,B143,Ausgaben!A:A))","v":""},{"$f":"IF(B143=\"\",\"\",SUMIF(Einnahmen!B:B,B143,Einnahmen!A:A))","v":""}]
[null,{"$f":"IF(Konfiguration!B134=\"\",\"\",Konfiguration!B134)","v":""},null,null,null,{"$f":"IF(Konfiguration!B134=\"\",\"\",Konfiguration!C134)","v":""},{"$f":"IF(Konfiguration!B134=\"\",\"\",Konfiguration!D134)","v":""},null,null,null,{"$f":"IF(B144=\"\",\"\",SUMIF(Ausgaben!B:B,B144,Ausgaben!A:A))","v":""},{"$f":"IF(B144=\"\",\"\",SUMIF(Einnahmen!B:B,B144,Einnahmen!A:A))","v":""}]
[null,{"$f":"IF(Konfiguration!B135=\"\",\"\",Konfiguration!B135)","v":""},null,null,null,{"$f":"IF(Konfiguration!B135=\"\",\"\",Konfiguration!C135)","v":""},{"$f":"IF(Konfiguration!B135=\"\",\"\",Konfiguration!D135)","v":""},null,null,null,{"$f":"IF(B145=\"\",\"\",SUMIF(Ausgaben!B:B,B145,Ausgaben!A:A))","v":""},{"$f":"IF(B145=\"\",\"\",SUMIF(Einnahmen!B:B,B145,Einnahmen!A:A))","v":""}]
[null,{"$f":"IF(Konfiguration!B136=\"\",\"\",Konfiguration!B136)","v":""},null,null,null,{"$f":"IF(Konfiguration!B136=\"\",\"\",Konfiguration!C136)","v":""},{"$f":"IF(Konfiguration!B136=\"\",\"\",Konfiguration!D136)","v":""},null,null,null,{"$f":"IF(B146=\"\",\"\",SUMIF(Ausgaben!B:B,B146,Ausgaben!A:A))","v":""},{"$f":"IF(B146=\"\",\"\",SUMIF(Einnahmen!B:B,B146,Einnahmen!A:A))","v":""}]
[null,{"$f":"IF(Konfiguration!B137=\"\",\"\",Konfiguration!B137)","v":""},null,null,null,{"$f":"IF(Konfiguration!B137=\"\",\"\",Konfiguration!C137)","v":""},{"$f":"IF(Konfiguration!B137=\"\",\"\",Konfiguration!D137)","v":""},null,null,null,{"$f":"IF(B147=\"\",\"\",SUMIF(Ausgaben!B:B,B147,Ausgaben!A:A))","v":""},{"$f":"IF(B147=\"\",\"\",SUMIF(Einnahmen!B:B,B147,Einnahmen!A:A))","v":""}]
[null,{"$f":"IF(Konfiguration!B138=\"\",\"\",Konfiguration!B138)","v":""},null,null,null,{"$f":"IF(Konfiguration!B138=\"\",\"\",Konfiguration!C138)","v":""},{"$f":"IF(Konfiguration!B138=\"\",\"\",Konfiguration!D138)","v":""},null,null,null,{"$f":"IF(B148=\"\",\"\",SUMIF(Ausgaben!B:B,B148,Ausgaben!A:A))","v":""},{"$f":"IF(B148=\"\",\"\",SUMIF(Einnahmen!B:B,B148,Einnahmen!A:A))","v":""}]
[null,{"$f":"IF(Konfiguration!B139=\"\",\"\",Konfiguration!B139)","v":""},null,null,null,{"$f":"IF(Konfiguration!B139=\"\",\"\",Konfiguration!C139)","v":""},{"$f":"IF(Konfiguration!B139=\"\",\"\",Konfiguration!D139)","v":""},null,null,null,{"$f":"IF(B149=\"\",\"\",SUMIF(Ausgaben!B:B,B149,Ausgaben!A:A))","v":""},{"$f":"IF(B149=\"\",\"\",SUMIF(Einnahmen!B:B,B149,Einnahmen!A:A))","v":""}]
[null,{"$f":"IF(Konfiguration!B140=\"\",\"\",Konfiguration!B140)","v":""},null,null,null,{"$f":"IF(Konfiguration!B140=\"\",\"\",Konfiguration!C140)","v":""},{"$f":"IF(Konfiguration!B140=\"\",\"\",Konfiguration!D140)","v":""},null,null,null,{"$f":"IF(B150=\"\",\"\",SUMIF(Ausgaben!B:B,B150,Ausgaben!A:A))","v":""},{"$f":"IF(B150=\"\",\"\",SUMIF(Einnahmen!B:B,B150,Einnahmen!A:A))","v":""}]
[null,{"$f":"IF(Konfiguration!B141=\"\",\"\",Konfiguration!B141)","v":""},null,null,null,{"$f":"IF(Konfiguration!B141=\"\",\"\",Konfiguration!C141)","v":""},{"$f":"IF(Konfiguration!B141=\"\",\"\",Konfiguration!D141)","v":""},null,null,null,{"$f":"IF(B151=\"\",\"\",SUMIF(Ausgaben!B:B,B151,Ausgaben!A:A))","v":""},{"$f":"IF(B151=\"\",\"\",SUMIF(Einnahmen!B:B,B151,Einnahmen!A:A))","v":""}]
[null,{"$f":"IF(Konfiguration!B142=\"\",\"\",Konfiguration!B142)","v":""},null,null,null,{"$f":"IF(Konfiguration!B142=\"\",\"\",Konfiguration!C142)","v":""},{"$f":"IF(Konfiguration!B142=\"\",\"\",Konfiguration!D142)","v":""},null,null,null,{"$f":"IF(B152=\"\",\"\",SUMIF(Ausgaben!B:B,B152,Ausgaben!A:A))","v":""},{"$f":"IF(B152=\"\",\"\",SUMIF(Einnahmen!B:B,B152,Einnahmen!A:A))","v":""}]
[null,{"$f":"IF(Konfiguration!B143=\"\",\"\",Konfiguration!B143)","v":""},null,null,null,{"$f":"IF(Konfiguration!B143=\"\",\"\",Konfiguration!C143)","v":""},{"$f":"IF(Konfiguration!B143=\"\",\"\",Konfiguration!D143)","v":""},null,null,null,{"$f":"IF(B153=\"\",\"\",SUMIF(Ausgaben!B:B,B153,Ausgaben!A:A))","v":""},{"$f":"IF(B153=\"\",\"\",SUMIF(Einnahmen!B:B,B153,Einnahmen!A:A))","v":""}]
[null,{"$f":"IF(Konfiguration!B144=\"\",\"\",Konfiguration!B144)","v":""},null,null,null,{"$f":"IF(Konfiguration!B144=\"\",\"\",Konfiguration!C144)","v":""},{"$f":"IF(Konfiguration!B144=\"\",\"\",Konfiguration!D144)","v":""},null,null,null,{"$f":"IF(B154=\"\",\"\",SUMIF(Ausgaben!B:B,B154,Ausgaben!A:A))","v":""},{"$f":"IF(B154=\"\",\"\",SUMIF(Einnahmen!B:B,B154,Einnahmen!A:A))","v":""}]
[null,{"$f":"IF(Konfiguration!B145=\"\",\"\",Konfiguration!B145)","v":""},null,null,null,{"$f":"IF(Konfiguration!B145=\"\",\"\",Konfiguration!C145)","v":""},{"$f":"IF(Konfiguration!B145=\"\",\"\",Konfiguration!D145)","v":""},null,null,null,{"$f":"IF(B155=\"\",\"\",SUMIF(Ausgaben!B:B,B155,Ausgaben!A:A))","v":""},{"$f":"IF(B155=\"\",\"\",SUMIF(Einnahmen!B:B,B155,Einnahmen!A:A))","v":""}]
[null,{"$f":"IF(Konfiguration!B146=\"\",\"\",Konfiguration!B146)","v":""},null,null,null,{"$f":"IF(Konfiguration!B146=\"\",\"\",Konfiguration!C146)","v":""},{"$f":"IF(Konfiguration!B146=\"\",\"\",Konfiguration!D146)","v":""},null,null,null,{"$f":"IF(B156=\"\",\"\",SUMIF(Ausgaben!B:B,B156,Ausgaben!A:A))","v":""},{"$f":"IF(B156=\"\",\"\",SUMIF(Einnahmen!B:B,B156,Einnahmen!A:A))","v":""}]
[null,{"$f":"IF(Konfiguration!B147=\"\",\"\",Konfiguration!B147)","v":""},null,null,null,{"$f":"IF(Konfiguration!B147=\"\",\"\",Konfiguration!C147)","v":""},{"$f":"IF(Konfiguration!B147=\"\",\"\",Konfiguration!D147)","v":""},null,null,null,{"$f":"IF(B157=\"\",\"\",SUMIF(Ausgaben!B:B,B157,Ausgaben!A:A))","v":""},{"$f":"IF(B157=\"\",\"\",SUMIF(Einnahmen!B:B,B157,Einnahmen!A:A))","v":""}]
[null,{"$f":"IF(Konfiguration!B148=\"\",\"\",Konfiguration!B148)","v":""},null,null,null,{"$f":"IF(Konfiguration!B148=\"\",\"\",Konfiguration!C148)","v":""},{"$f":"IF(Konfiguration!B148=\"\",\"\",Konfiguration!D148)","v":""},null,null,null,{"$f":"IF(B158=\"\",\"\",SUMIF(Ausgaben!B:B,B158,Ausgaben!A:A))","v":""},{"$f":"IF(B158=\"\",\"\",SUMIF(Einnahmen!B:B,B158,Einnahmen!A:A))","v":""}]
[null,{"$f":"IF(Konfiguration!B149=\"\",\"\",Konfiguration!B149)","v":""},null,null,null,{"$f":"IF(Konfiguration!B149=\"\",\"\",Konfiguration!C149)","v":""},{"$f":"IF(Konfiguration!B149=\"\",\"\",Konfiguration!D149)","v":""},null,null,null,{"$f":"IF(B159=\"\",\"\",SUMIF(Ausgaben!B:B,B159,Ausgaben!A:A))","v":""},{"$f":"IF(B159=\"\",\"\",SUMIF(Einnahmen!B:B,B159,Einnahmen!A:A))","v":""}]
[null,{"$f":"IF(Konfiguration!B150=\"\",\"\",Konfiguration!B150)","v":""},null,null,null,{"$f":"IF(Konfiguration!B150=\"\",\"\",Konfiguration!C150)","v":""},{"$f":"IF(Konfiguration!B150=\"\",\"\",Konfiguration!D150)","v":""},null,null,null,{"$f":"IF(B160=\"\",\"\",SUMIF(Ausgaben!B:B,B160,Ausgaben!A:A))","v":""},{"$f":"IF(B160=\"\",\"\",SUMIF(Einnahmen!B:B,B160,Einnahmen!A:A))","v":""}]
[null,{"$f":"IF(Konfiguration!B151=\"\",\"\",Konfiguration!B151)","v":""},null,null,null,{"$f":"IF(Konfiguration!B151=\"\",\"\",Konfiguration!C151)","v":""},{"$f":"IF(Konfiguration!B151=\"\",\"\",Konfiguration!D151)","v":""},null,null,null,{"$f":"IF(B161=\"\",\"\",SUMIF(Ausgaben!B:B,B161,Ausgaben!A:A))","v":""},{"$f":"IF(B161=\"\",\"\",SUMIF(Einnahmen!B:B,B161,Einnahmen!A:A))","v":""}]
[null,{"$f":"IF(Konfiguration!B152=\"\",\"\",Konfiguration!B152)","v":""},null,null,null,{"$f":"IF(Konfiguration!B152=\"\",\"\",Konfiguration!C152)","v":""},{"$f":"IF(Konfiguration!B152=\"\",\"\",Konfiguration!D152)","v":""},null,null,null,{"$f":"IF(B162=\"\",\"\",SUMIF(Ausgaben!B:B,B162,Ausgaben!A:A))","v":""},{"$f":"IF(B162=\"\",\"\",SUMIF(Einnahmen!B:B,B162,Einnahmen!A:A))","v":""}]
[null,{"$f":"IF(Konfiguration!B153=\"\",\"\",Konfiguration!B153)","v":""},null,null,null,{"$f":"IF(Konfiguration!B153=\"\",\"\",Konfiguration!C153)","v":""},{"$f":"IF(Konfiguration!B153=\"\",\"\",Konfiguration!D153)","v":""},null,null,null,{"$f":"IF(B163=\"\",\"\",SUMIF(Ausgaben!B:B,B163,Ausgaben!A:A))","v":""},{"$f":"IF(B163=\"\",\"\",SUMIF(Einnahmen!B:B,B163,Einnahmen!A:A))","v":""}]
[null,{"$f":"IF(Konfiguration!B154=\"\",\"\",Konfiguration!B154)","v":""},null,null,null,{"$f":"IF(Konfiguration!B154=\"\",\"\",Konfiguration!C154)","v":""},{"$f":"IF(Konfiguration!B154=\"\",\"\",Konfiguration!D154)","v":""},null,null,null,{"$f":"IF(B164=\"\",\"\",SUMIF(Ausgaben!B:B,B164,Ausgaben!A:A))","v":""},{"$f":"IF(B164=\"\",\"\",SUMIF(Einnahmen!B:B,B164,Einnahmen!A:A))","v":""}]
[null,{"$f":"IF(Konfiguration!B155=\"\",\"\",Konfiguration!B155)","v":""},null,null,null,{"$f":"IF(Konfiguration!B155=\"\",\"\",Konfiguration!C155)","v":""},{"$f":"IF(Konfiguration!B155=\"\",\"\",Konfiguration!D155)","v":""},null,null,null,{"$f":"IF(B165=\"\",\"\",SUMIF(Ausgaben!B:B,B165,Ausgaben!A:A))","v":""},{"$f":"IF(B165=\"\",\"\",SUMIF(Einnahmen!B:B,B165,Einnahmen!A:A))","v":""}]
[null,{"$f":"IF(Konfiguration!B156=\"\",\"\",Konfiguration!B156)","v":""},null,null,null,{"$f":"IF(Konfiguration!B156=\"\",\"\",Konfiguration!C156)","v":""},{"$f":"IF(Konfiguration!B156=\"\",\"\",Konfiguration!D156)","v":""},null,null,null,{"$f":"IF(B166=\"\",\"\",SUMIF(Ausgaben!B:B,B166,Ausgaben!A:A))","v":""},{"$f":"IF(B166=\"\",\"\",SUMIF(Einnahmen!B:B,B166,Einnahmen!A:A))","v":""}]
[null,{"$f":"IF(Konfiguration!B157=\"\",\"\",Konfiguration!B157)","v":""},null,null,null,{"$f":"IF(Konfiguration!B157=\"\",\"\",Konfiguration!C157)","v":""},{"$f":"IF(Konfiguration!B157=\"\",\"\",Konfiguration!D157)","v":""},null,null,null,{"$f":"IF(B167=\"\",\"\",SUMIF(Ausgaben!B:B,B167,Ausgaben!A:A))","v":""},{"$f":"IF(B167=\"\",\"\",SUMIF(Einnahmen!B:B,B167,Einnahmen!A:A))","v":""}]
[null,{"$f":"IF(Konfiguration!B158=\"\",\"\",Konfiguration!B158)","v":""},null,null,null,{"$f":"IF(Konfiguration!B158=\"\",\"\",Konfiguration!C158)","v":""},{"$f":"IF(Konfiguration!B158=\"\",\"\",Konfiguration!D158)","v":""},null,null,null,{"$f":"IF(B168=\"\",\"\",SUMIF(Ausgaben!B:B,B168,Ausgaben!A:A))","v":""},{"$f":"IF(B168=\"\",\"\",SUMIF(Einnahmen!B:B,B168,Einnahmen!A:A))","v":""}]
[null,{"$f":"IF(Konfiguration!B159=\"\",\"\",Konfiguration!B159)","v":""},null,null,null,{"$f":"IF(Konfiguration!B159=\"\",\"\",Konfiguration!C159)","v":""},{"$f":"IF(Konfiguration!B159=\"\",\"\",Konfiguration!D159)","v":""},null,null,null,{"$f":"IF(B169=\"\",\"\",SUMIF(Ausgaben!B:B,B169,Ausgaben!A:A))","v":""},{"$f":"IF(B169=\"\",\"\",SUMIF(Einnahmen!B:B,B169,Einnahmen!A:A))","v":""}]
[null,{"$f":"IF(Konfiguration!B160=\"\",\"\",Konfiguration!B160)","v":""},null,null,null,{"$f":"IF(Konfiguration!B160=\"\",\"\",Konfiguration!C160)","v":""},{"$f":"IF(Konfiguration!B160=\"\",\"\",Konfiguration!D160)","v":""},null,null,null,{"$f":"IF(B170=\"\",\"\",SUMIF(Ausgaben!B:B,B170,Ausgaben!A:A))","v":""},{"$f":"IF(B170=\"\",\"\",SUMIF(Einnahmen!B:B,B170,Einnahmen!A:A))","v":""}]
[null,{"$f":"IF(Konfiguration!B161=\"\",\"\",Konfiguration!B161)","v":""},null,null,null,{"$f":"IF(Konfiguration!B161=\"\",\"\",Konfiguration!C161)","v":""},{"$f":"IF(Konfiguration!B161=\"\",\"\",Konfiguration!D161)","v":""},null,null,null,{"$f":"IF(B171=\"\",\"\",SUMIF(Ausgaben!B:B,B171,Ausgaben!A:A))","v":""},{"$f":"IF(B171=\"\",\"\",SUMIF(Einnahmen!B:B,B171,Einnahmen!A:A))","v":""}]
[null,{"$f":"IF(Konfiguration!B162=\"\",\"\",Konfiguration!B162)","v":""},null,null,null,{"$f":"IF(Konfiguration!B162=\"\",\"\",Konfiguration!C162)","v":""},{"$f":"IF(Konfiguration!B162=\"\",\"\",Konfiguration!D162)","v":""},null,null,null,{"$f":"IF(B172=\"\",\"\",SUMIF(Ausgaben!B:B,B172,Ausgaben!A:A))","v":""},{"$f":"IF(B172=\"\",\"\",SUMIF(Einnahmen!B:B,B172,Einnahmen!A:A))","v":""}]
[null,{"$f":"IF(Konfiguration!B163=\"\",\"\",Konfiguration!B163)","v":""},null,null,null,{"$f":"IF(Konfiguration!B163=\"\",\"\",Konfiguration!C163)","v":""},{"$f":"IF(Konfiguration!B163=\"\",\"\",Konfiguration!D163)","v":""},null,null,null,{"$f":"IF(B173=\"\",\"\",SUMIF(Ausgaben!B:B,B173,Ausgaben!A:A))","v":""},{"$f":"IF(B173=\"\",\"\",SUMIF(Einnahmen!B:B,B173,Einnahmen!A:A))","v":""}]
[null,{"$f":"IF(Konfiguration!B164=\"\",\"\",Konfiguration!B164)","v":""},null,null,null,{"$f":"IF(Konfiguration!B164=\"\",\"\",Konfiguration!C164)","v":""},{"$f":"IF(Konfiguration!B164=\"\",\"\",Konfiguration!D164)","v":""},null,null,null,{"$f":"IF(B174=\"\",\"\",SUMIF(Ausgaben!B:B,B174,Ausgaben!A:A))","v":""},{"$f":"IF(B174=\"\",\"\",SUMIF(Einnahmen!B:B,B174,Einnahmen!A:A))","v":""}]
[null,{"$f":"IF(Konfiguration!B165=\"\",\"\",Konfiguration!B165)","v":""},null,null,null,{"$f":"IF(Konfiguration!B165=\"\",\"\",Konfiguration!C165)","v":""},{"$f":"IF(Konfiguration!B165=\"\",\"\",Konfiguration!D165)","v":""},null,null,null,{"$f":"IF(B175=\"\",\"\",SUMIF(Ausgaben!B:B,B175,Ausgaben!A:A))","v":""},{"$f":"IF(B175=\"\",\"\",SUMIF(Einnahmen!B:B,B175,Einnahmen!A:A))","v":""}]
[null,{"$f":"IF(Konfiguration!B166=\"\",\"\",Konfiguration!B166)","v":""},null,null,null,{"$f":"IF(Konfiguration!B166=\"\",\"\",Konfiguration!C166)","v":""},{"$f":"IF(Konfiguration!B166=\"\",\"\",Konfiguration!D166)","v":""},null,null,null,{"$f":"IF(B176=\"\",\"\",SUMIF(Ausgaben!B:B,B176,Ausgaben!A:A))","v":""},{"$f":"IF(B176=\"\",\"\",SUMIF(Einnahmen!B:B,B176,Einnahmen!A:A))","v":""}]
[null,{"$f":"IF(Konfiguration!B167=\"\",\"\",Konfiguration!B167)","v":""},null,null,null,{"$f":"IF(Konfiguration!B167=\"\",\"\",Konfiguration!C167)","v":""},{"$f":"IF(Konfiguration!B167=\"\",\"\",Konfiguration!D167)","v":""},null,null,null,{"$f":"IF(B177=\"\",\"\",SUMIF(Ausgaben!B:B,B177,Ausgaben!A:A))","v":""},{"$f":"IF(B177=\"\",\"\",SUMIF(Einnahmen!B:B,B177,Einnahmen!A:A))","v":""}]
[null,{"$f":"IF(Konfiguration!B168=\"\",\"\",Konfiguration!B168)","v":""},null,null,null,{"$f":"IF(Konfiguration!B168=\"\",\"\",Konfiguration!C168)","v":""},{"$f":"IF(Konfiguration!B168=\"\",\"\",Konfiguration!D168)","v":""},null,null,null,{"$f":"IF(B178=\"\",\"\",SUMIF(Ausgaben!B:B,B178,Ausgaben!A:A))","v":""},{"$f":"IF(B178=\"\",\"\",SUMIF(Einnahmen!B:B,B178,Einnahmen!A:A))","v":""}]
[null,{"$f":"IF(Konfiguration!B169=\"\",\"\",Konfiguration!B169)","v":""},null,null,null,{"$f":"IF(Konfiguration!B169=\"\",\"\",Konfiguration!C169)","v":""},{"$f":"IF(Konfiguration!B169=\"\",\"\",Konfiguration!D169)","v":""},null,null,null,{"$f":"IF(B179=\"\",\"\",SUMIF(Ausgaben!B:B,B179,Ausgaben!A:A))","v":""},{"$f":"IF(B179=\"\",\"\",SUMIF(Einnahmen!B:B,B179,Einnahmen!A:A))","v":""}]
[null,{"$f":"IF(Konfiguration!B170=\"\",\"\",Konfiguration!B170)","v":""},null,null,null,{"$f":"IF(Konfiguration!B170=\"\",\"\",Konfiguration!C170)","v":""},{"$f":"IF(Konfiguration!B170=\"\",\"\",Konfiguration!D170)","v":""},null,null,null,{"$f":"IF(B180=\"\",\"\",SUMIF(Ausgaben!B:B,B180,Ausgaben!A:A))","v":""},{"$f":"IF(B180=\"\",\"\",SUMIF(Einnahmen!B:B,B180,Einnahmen!A:A))","v":""}]
[null,{"$f":"IF(Konfiguration!B171=\"\",\"\",Konfiguration!B171)","v":""},null,null,null,{"$f":"IF(Konfiguration!B171=\"\",\"\",Konfiguration!C171)","v":""},{"$f":"IF(Konfiguration!B171=\"\",\"\",Konfiguration!D171)","v":""},null,null,null,{"$f":"IF(B181=\"\",\"\",SUMIF(Ausgaben!B:B,B181,Ausgaben!A:A))","v":""},{"$f":"IF(B181=\"\",\"\",SUMIF(Einnahmen!B:B,B181,Einnahmen!A:A))","v":""}]
[null,{"$f":"IF(Konfiguration!B172=\"\",\"\",Konfiguration!B172)","v":""},null,null,null,{"$f":"IF(Konfiguration!B172=\"\",\"\",Konfiguration!C172)","v":""},{"$f":"IF(Konfiguration!B172=\"\",\"\",Konfiguration!D172)","v":""},null,null,null,{"$f":"IF(B182=\"\",\"\",SUMIF(Ausgaben!B:B,B182,Ausgaben!A:A))","v":""},{"$f":"IF(B182=\"\",\"\",SUMIF(Einnahmen!B:B,B182,Einnahmen!A:A))","v":""}]
[null,{"$f":"IF(Konfiguration!B173=\"\",\"\",Konfiguration!B173)","v":""},null,null,null,{"$f":"IF(Konfiguration!B173=\"\",\"\",Konfiguration!C173)","v":""},{"$f":"IF(Konfiguration!B173=\"\",\"\",Konfiguration!D173)","v":""},null,null,null,{"$f":"IF(B183=\"\",\"\",SUMIF(Ausgaben!B:B,B183,Ausgaben!A:A))","v":""},{"$f":"IF(B183=\"\",\"\",SUMIF(Einnahmen!B:B,B183,Einnahmen!A:A))","v":""}]
[null,{"$f":"IF(Konfiguration!B174=\"\",\"\",Konfiguration!B174)","v":""},null,null,null,{"$f":"IF(Konfiguration!B174=\"\",\"\",Konfiguration!C174)","v":""},{"$f":"IF(Konfiguration!B174=\"\",\"\",Konfiguration!D174)","v":""},null,null,null,{"$f":"IF(B184=\"\",\"\",SUMIF(Ausgaben!B:B,B184,Ausgaben!A:A))","v":""},{"$f":"IF(B184=\"\",\"\",SUMIF(Einnahmen!B:B,B184,Einnahmen!A:A))","v":""}]
[null,{"$f":"IF(Konfiguration!B175=\"\",\"\",Konfiguration!B175)","v":""},null,null,null,{"$f":"IF(Konfiguration!B175=\"\",\"\",Konfiguration!C175)","v":""},{"$f":"IF(Konfiguration!B175=\"\",\"\",Konfiguration!D175)","v":""},null,null,null,{"$f":"IF(B185=\"\",\"\",SUMIF(Ausgaben!B:B,B185,Ausgaben!A:A))","v":""},{"$f":"IF(B185=\"\",\"\",SUMIF(Einnahmen!B:B,B185,Einnahmen!A:A))","v":""}]
[null,{"$f":"IF(Konfiguration!B176=\"\",\"\",Konfiguration!B176)","v":""},null,null,null,{"$f":"IF(Konfiguration!B176=\"\",\"\",Konfiguration!C176)","v":""},{"$f":"IF(Konfiguration!B176=\"\",\"\",Konfiguration!D176)","v":""},null,null,null,{"$f":"IF(B186=\"\",\"\",SUMIF(Ausgaben!B:B,B186,Ausgaben!A:A))","v":""},{"$f":"IF(B186=\"\",\"\",SUMIF(Einnahmen!B:B,B186,Einnahmen!A:A))","v":""}]
[null,{"$f":"IF(Konfiguration!B177=\"\",\"\",Konfiguration!B177)","v":""},null,null,null,{"$f":"IF(Konfiguration!B177=\"\",\"\",Konfiguration!C177)","v":""},{"$f":"IF(Konfiguration!B177=\"\",\"\",Konfiguration!D177)","v":""},null,null,null,{"$f":"IF(B187=\"\",\"\",SUMIF(Ausgaben!B:B,B187,Ausgaben!A:A))","v":""},{"$f":"IF(B187=\"\",\"\",SUMIF(Einnahmen!B:B,B187,Einnahmen!A:A))","v":""}]
[null,{"$f":"IF(Konfiguration!B178=\"\",\"\",Konfiguration!B178)","v":""},null,null,null,{"$f":"IF(Konfiguration!B178=\"\",\"\",Konfiguration!C178)","v":""},{"$f":"IF(Konfiguration!B178=\"\",\"\",Konfiguration!D178)","v":""},null,null,null,{"$f":"IF(B188=\"\",\"\",SUMIF(Ausgaben!B:B,B188,Ausgaben!A:A))","v":""},{"$f":"IF(B188=\"\",\"\",SUMIF(Einnahmen!B:B,B188,Einnahmen!A:A))","v":""}]
[null,{"$f":"IF(Konfiguration!B179=\"\",\"\",Konfiguration!B179)","v":""},null,null,null,{"$f":"IF(Konfiguration!B179=\"\",\"\",Konfiguration!C179)","v":""},{"$f":"IF(Konfiguration!B179=\"\",\"\",Konfiguration!D179)","v":""},null,null,null,{"$f":"IF(B189=\"\",\"\",SUMIF(Ausgaben!B:B,B189,Ausgaben!A:A))","v":""},{"$f":"IF(B189=\"\",\"\",SUMIF(Einnahmen!B:B,B189,Einnahmen!A:A))","v":""}]
[null,{"$f":"IF(Konfiguration!B180=\"\",\"\",Konfiguration!B180)","v":""},null,null,null,{"$f":"IF(Konfiguration!B180=\"\",\"\",Konfiguration!C180)","v":""},{"$f":"IF(Konfiguration!B180=\"\",\"\",Konfiguration!D180)","v":""},null,null,null,{"$f":"IF(B190=\"\",\"\",SUMIF(Ausgaben!B:B,B190,Ausgaben!A:A))","v":""},{"$f":"IF(B190=\"\",\"\",SUMIF(Einnahmen!B:B,B190,Einnahmen!A:A))","v":""}]
[null,{"$f":"IF(Konfiguration!B181=\"\",\"\",Konfiguration!B181)","v":""},null,null,null,{"$f":"IF(Konfiguration!B181=\"\",\"\",Konfiguration!C181)","v":""},{"$f":"IF(Konfiguration!B181=\"\",\"\",Konfiguration!D181)","v":""},null,null,null,{"$f":"IF(B191=\"\",\"\",SUMIF(Ausgaben!B:B,B191,Ausgaben!A:A))","v":""},{"$f":"IF(B191=\"\",\"\",SUMIF(Einnahmen!B:B,B191,Einnahmen!A:A))","v":""}]
[null,{"$f":"IF(Konfiguration!B182=\"\",\"\",Konfiguration!B182)","v":""},null,null,null,{"$f":"IF(Konfiguration!B182=\"\",\"\",Konfiguration!C182)","v":""},{"$f":"IF(Konfiguration!B182=\"\",\"\",Konfiguration!D182)","v":""},null,null,null,{"$f":"IF(B192=\"\",\"\",SUMIF(Ausgaben!B:B,B192,Ausgaben!A:A))","v":""},{"$f":"IF(B192=\"\",\"\",SUMIF(Einnahmen!B:B,B192,Einnahmen!A:A))","v":""}]
[null,{"$f":"IF(Konfiguration!B183=\"\",\"\",Konfiguration!B183)","v":""},null,null,null,{"$f":"IF(Konfiguration!B183=\"\",\"\",Konfiguration!C183)","v":""},{"$f":"IF(Konfiguration!B183=\"\",\"\",Konfiguration!D183)","v":""},null,null,null,{"$f":"IF(B193=\"\",\"\",SUMIF(Ausgaben!B:B,B193,Ausgaben!A:A))","v":""},{"$f":"IF(B193=\"\",\"\",SUMIF(Einnahmen!B:B,B193,Einnahmen!A:A))","v":""}]
[null,{"$f":"IF(Konfiguration!B184=\"\",\"\",Konfiguration!B184)","v":""},null,null,null,{"$f":"IF(Konfiguration!B184=\"\",\"\",Konfiguration!C184)","v":""},{"$f":"IF(Konfiguration!B184=\"\",\"\",Konfiguration!D184)","v":""},null,null,null,{"$f":"IF(B194=\"\",\"\",SUMIF(Ausgaben!B:B,B194,Ausgaben!A:A))","v":""},{"$f":"IF(B194=\"\",\"\",SUMIF(Einnahmen!B:B,B194,Einnahmen!A:A))","v":""}]
[null,{"$f":"IF(Konfiguration!B185=\"\",\"\",Konfiguration!B185)","v":""},null,null,null,{"$f":"IF(Konfiguration!B185=\"\",\"\",Konfiguration!C185)","v":""},{"$f":"IF(Konfiguration!B185=\"\",\"\",Konfiguration!D185)","v":""},null,null,null,{"$f":"IF(B195=\"\",\"\",SUMIF(Ausgaben!B:B,B195,Ausgaben!A:A))","v":""},{"$f":"IF(B195=\"\",\"\",SUMIF(Einnahmen!B:B,B195,Einnahmen!A:A))","v":""}]
[null,{"$f":"IF(Konfiguration!B186=\"\",\"\",Konfiguration!B186)","v":""},null,null,null,{"$f":"IF(Konfiguration!B186=\"\",\"\",Konfiguration!C186)","v":""},{"$f":"IF(Konfiguration!B186=\"\",\"\",Konfiguration!D186)","v":""},null,null,null,{"$f":"IF(B196=\"\",\"\",SUMIF(Ausgaben!B:B,B196,Ausgaben!A:A))","v":""},{"$f":"IF(B196=\"\",\"\",SUMIF(Einnahmen!B:B,B196,Einnahmen!A:A))","v":""}]
[null,{"$f":"IF(Konfiguration!B187=\"\",\"\",Konfiguration!B187)","v":""},null,null,null,{"$f":"IF(Konfiguration!B187=\"\",\"\",Konfiguration!C187)","v":""},{"$f":"IF(Konfiguration!B187=\"\",\"\",Konfiguration!D187)","v":""},null,null,null,{"$f":"IF(B197=\"\",\"\",SUMIF(Ausgaben!B:B,B197,Ausgaben!A:A))","v":""},{"$f":"IF(B197=\"\",\"\",SUMIF(Einnahmen!B:B,B197,Einnahmen!A:A))","v":""}]
[null,{"$f":"IF(Konfiguration!B188=\"\",\"\",Konfiguration!B188)","v":""},null,null,null,{"$f":"IF(Konfiguration!B188=\"\",\"\",Konfiguration!C188)","v":""},{"$f":"IF(Konfiguration!B188=\"\",\"\",Konfiguration!D188)","v":""},null,null,null,{"$f":"IF(B198=\"\",\"\",SUMIF(Ausgaben!B:B,B198,Ausgaben!A:A))","v":""},{"$f":"IF(B198=\"\",\"\",SUMIF(Einnahmen!B:B,B198,Einnahmen!A:A))","v":""}]
[null,{"$f":"IF(Konfiguration!B189=\"\",\"\",Konfiguration!B189)","v":""},null,null,null,{"$f":"IF(Konfiguration!B189=\"\",\"\",Konfiguration!C189)","v":""},{"$f":"IF(Konfiguration!B189=\"\",\"\",Konfiguration!D189)","v":""},null,null,null,{"$f":"IF(B199=\"\",\"\",SUMIF(Ausgaben!B:B,B199,Ausgaben!A:A))","v":""},{"$f":"IF(B199=\"\",\"\",SUMIF(Einnahmen!B:B,B199,Einnahmen!A:A))","v":""}]
[null,{"$f":"IF(Konfiguration!B190=\"\",\"\",Konfiguration!B190)","v":""},null,null,null,{"$f":"IF(Konfiguration!B190=\"\",\"\",Konfiguration!C190)","v":""},{"$f":"IF(Konfiguration!B190=\"\",\"\",Konfiguration!D190)","v":""},null,null,null,{"$f":"IF(B200=\"\",\"\",SUMIF(Ausgaben!B:B,B200,Ausgaben!A:A))","v":""},{"$f":"IF(B200=\"\",\"\",SUMIF(Einnahmen!B:B,B200,Einnahmen!A:A))","v":""}]
[null,{"$f":"IF(Konfiguration!B191=\"\",\"\",Konfiguration!B191)","v":""},null,null,null,{"$f":"IF(Konfiguration!B191=\"\",\"\",Konfiguration!C191)","v":""},{"$f":"IF(Konfiguration!B191=\"\",\"\",Konfiguration!D191)","v":""},null,null,null,{"$f":"IF(B201=\"\",\"\",SUMIF(Ausgaben!B:B,B201,Ausgaben!A:A))","v":""},{"$f":"IF(B201=\"\",\"\",SUMIF(Einnahmen!B:B,B201,Einnahmen!A:A))","v":""}]
[null,{"$f":"IF(Konfiguration!B192=\"\",\"\",Konfiguration!B192)","v":""},null,null,null,{"$f":"IF(Konfiguration!B192=\"\",\"\",Konfiguration!C192)","v":""},{"$f":"IF(Konfiguration!B192=\"\",\"\",Konfiguration!D192)","v":""},null,null,null,{"$f":"IF(B202=\"\",\"\",SUMIF(Ausgaben!B:B,B202,Ausgaben!A:A))","v":""},{"$f":"IF(B202=\"\",\"\",SUMIF(Einnahmen!B:B,B202,Einnahmen!A:A))","v":""}]
[null,{"$f":"IF(Konfiguration!B193=\"\",\"\",Konfiguration!B193)","v":""},null,null,null,{"$f":"IF(Konfiguration!B193=\"\",\"\",Konfiguration!C193)","v":""},{"$f":"IF(Konfiguration!B193=\"\",\"\",Konfiguration!D193)","v":""},null,null,null,{"$f":"IF(B203=\"\",\"\",SUMIF(Ausgaben!B:B,B203,Ausgaben!A:A))","v":""},{"$f":"IF(B203=\"\",\"\",SUMIF(Einnahmen!B:B,B203,Einnahmen!A:A))","v":""}]
[null,{"$f":"IF(Konfiguration!B194=\"\",\"\",Konfiguration!B194)","v":""},null,null,null,{"$f":"IF(Konfiguration!B194=\"\",\"\",Konfiguration!C194)","v":""},{"$f":"IF(Konfiguration!B194=\"\",\"\",Konfiguration!D194)","v":""},null,null,null,{"$f":"IF(B204=\"\",\"\",SUMIF(Ausgaben!B:B,B204,Ausgaben!A:A))","v":""},{"$f":"IF(B204=\"\",\"\",SUMIF(Einnahmen!B:B,B204,Einnahmen!A:A))","v":""}]
[null,{"$f":"IF(Konfiguration!B195=\"\",\"\",Konfiguration!B195)","v":""},null,null,null,{"$f":"IF(Konfiguration!B195=\"\",\"\",Konfiguration!C195)","v":""},{"$f":"IF(Konfiguration!B195=\"\",\"\",Konfiguration!D195)","v":""},null,null,null,{"$f":"IF(B205=\"\",\"\",SUMIF(Ausgaben!B:B,B205,Ausgaben!A:A))","v":""},{"$f":"IF(B205=\"\",\"\",SUMIF(Einnahmen!B:B,B205,Einnahmen!A:A))","v":""}]
[null,{"$f":"IF(Konfiguration!B196=\"\",\"\",Konfiguration!B196)","v":""},null,null,null,{"$f":"IF(Konfiguration!B196=\"\",\"\",Konfiguration!C196)","v":""},{"$f":"IF(Konfiguration!B196=\"\",\"\",Konfiguration!D196)","v":""},null,null,null,{"$f":"IF(B206=\"\",\"\",SUMIF(Ausgaben!B:B,B206,Ausgaben!A:A))","v":""},{"$f":"IF(B206=\"\",\"\",SUMIF(Einnahmen!B:B,B206,Einnahmen!A:A))","v":""}]
[null,{"$f":"IF(Konfiguration!B197=\"\",\"\",Konfiguration!B197)","v":""},null,null,null,{"$f":"IF(Konfiguration!B197=\"\",\"\",Konfiguration!C197)","v":""},{"$f":"IF(Konfiguration!B197=\"\",\"\",Konfiguration!D197)","v":""},null,null,null,{"$f":"IF(B207=\"\",\"\",SUMIF(Ausgaben!B:B,B207,Ausgaben!A:A))","v":""},{"$f":"IF(B207=\"\",\"\",SUMIF(Einnahmen!B:B,B207,Einnahmen!A:A))","v":""}]
[null,{"$f":"IF(Konfiguration!B198=\"\",\"\",Konfiguration!B198)","v":""},null,null,null,{"$f":"IF(Konfiguration!B198=\"\",\"\",Konfiguration!C198)","v":""},{"$f":"IF(Konfiguration!B198=\"\",\"\",Konfiguration!D198)","v":""},null,null,null,{"$f":"IF(B208=\"\",\"\",SUMIF(Ausgaben!B:B,B208,Ausgaben!A:A))","v":""},{"$f":"IF(B208=\"\",\"\",SUMIF(Einnahmen!B:B,B208,Einnahmen!A:A))","v":""}]
[null,{"$f":"IF(Konfiguration!B199=\"\",\"\",Konfiguration!B199)","v":""},null,null,null,{"$f":"IF(Konfiguration!B199=\"\",\"\",Konfiguration!C199)","v":""},{"$f":"IF(Konfiguration!B199=\"\",\"\",Konfiguration!D199)","v":""},null,null,null,{"$f":"IF(B209=\"\",\"\",SUMIF(Ausgaben!B:B,B209,Ausgaben!A:A))","v":""},{"$f":"IF(B209=\"\",\"\",SUMIF(Einnahmen!B:B,B209,Einnahmen!A:A))","v":""}]
[null,{"$f":"IF(Konfiguration!B200=\"\",\"\",Konfiguration!B200)","v":""},null,null,null,{"$f":"IF(Konfiguration!B200=\"\",\"\",Konfiguration!C200)","v":""},{"$f":"IF(Konfiguration!B200=\"\",\"\",Konfiguration!D200)","v":""},null,null,null,{"$f":"IF(B210=\"\",\"\",SUMIF(Ausgaben!B:B,B210,Ausgaben!A:A))","v":""},{"$f":"IF(B210=\"\",\"\",SUMIF(Einnahmen!B:B,B210,Einnahmen!A:A))","v":""}]
[null,{"$f":"IF(Konfiguration!B201=\"\",\"\",Konfiguration!B201)","v":""},null,null,null,{"$f":"IF(Konfiguration!B201=\"\",\"\",Konfiguration!C201)","v":""},{"$f":"IF(Konfiguration!B201=\"\",\"\",Konfiguration!D201)","v":""},null,null,null,{"$f":"IF(B211=\"\",\"\",SUMIF(Ausgaben!B:B,B211,Ausgaben!A:A))","v":""},{"$f":"IF(B211=\"\",\"\",SUMIF(Einnahmen!B:B,B211,Einnahmen!A:A))","v":""}]
[null,{"$f":"IF(Konfiguration!B202=\"\",\"\",Konfiguration!B202)","v":""},null,null,null,{"$f":"IF(Konfiguration!B202=\"\",\"\",Konfiguration!C202)","v":""},{"$f":"IF(Konfiguration!B202=\"\",\"\",Konfiguration!D202)","v":""},null,null,null,{"$f":"IF(B212=\"\",\"\",SUMIF(Ausgaben!B:B,B212,Ausgaben!A:A))","v":""},{"$f":"IF(B212=\"\",\"\",SUMIF(Einnahmen!B:B,B212,Einnahmen!A:A))","v":""}]
[null,{"$f":"IF(Konfiguration!B203=\"\",\"\",Konfiguration!B203)","v":""},null,null,null,{"$f":"IF(Konfiguration!B203=\"\",\"\",Konfiguration!C203)","v":""},{"$f":"IF(Konfiguration!B203=\"\",\"\",Konfiguration!D203)","v":""},null,null,null,{"$f":"IF(B213=\"\",\"\",SUMIF(Ausgaben!B:B,B213,Ausgaben!A:A))","v":""},{"$f":"IF(B213=\"\",\"\",SUMIF(Einnahmen!B:B,B213,Einnahmen!A:A))","v":""}]
[null,{"$f":"IF(Konfiguration!B204=\"\",\"\",Konfiguration!B204)","v":""},null,null,null,{"$f":"IF(Konfiguration!B204=\"\",\"\",Konfiguration!C204)","v":""},{"$f":"IF(Konfiguration!B204=\"\",\"\",Konfiguration!D204)","v":""},null,null,null,{"$f":"IF(B214=\"\",\"\",SUMIF(Ausgaben!B:B,B214,Ausgaben!A:A))","v":""},{"$f":"IF(B214=\"\",\"\",SUMIF(Einnahmen!B:B,B214,Einnahmen!A:A))","v":""}]
[null,{"$f":"IF(Konfiguration!B205=\"\",\"\",Konfiguration!B205)","v":""},null,null,null,{"$f":"IF(Konfiguration!B205=\"\",\"\",Konfiguration!C205)","v":""},{"$f":"IF(Konfiguration!B205=\"\",\"\",Konfiguration!D205)","v":""},null,null,null,{"$f":"IF(B215=\"\",\"\",SUMIF(Ausgaben!B:B,B215,Ausgaben!A:A))","v":""},{"$f":"IF(B215=\"\",\"\",SUMIF(Einnahmen!B:B,B215,Einnahmen!A:A))","v":""}]
[null,{"$f":"IF(Konfiguration!B206=\"\",\"\",Konfiguration!B206)","v":""},null,null,null,{"$f":"IF(Konfiguration!B206=\"\",\"\",Konfiguration!C206)","v":""},{"$f":"IF(Konfiguration!B206=\"\",\"\",Konfiguration!D206)","v":""},null,null,null,{"$f":"IF(B216=\"\",\"\",SUMIF(Ausgaben!B:B,B216,Ausgaben!A:A))","v":""},{"$f":"IF(B216=\"\",\"\",SUMIF(Einnahmen!B:B,B216,Einnahmen!A:A))","v":""}]
[null,{"$f":"IF(Konfiguration!B207=\"\",\"\",Konfiguration!B207)","v":""},null,null,null,{"$f":"IF(Konfiguration!B207=\"\",\"\",Konfiguration!C207)","v":""},{"$f":"IF(Konfiguration!B207=\"\",\"\",Konfiguration!D207)","v":""},null,null,null,{"$f":"IF(B217=\"\",\"\",SUMIF(Ausgaben!B:B,B217,Ausgaben!A:A))","v":""},{"$f":"IF(B217=\"\",\"\",SUMIF(Einnahmen!B:B,B217,Einnahmen!A:A))","v":""}]
[null,{"$f":"IF(Konfiguration!B208=\"\",\"\",Konfiguration!B208)","v":""},null,null,null,{"$f":"IF(Konfiguration!B208=\"\",\"\",Konfiguration!C208)","v":""},{"$f":"IF(Konfiguration!B208=\"\",\"\",Konfiguration!D208)","v":""},null,null,null,{"$f":"IF(B218=\"\",\"\",SUMIF(Ausgaben!B:B,B218,Ausgaben!A:A))","v":""},{"$f":"IF(B218=\"\",\"\",SUMIF(Einnahmen!B:B,B218,Einnahmen!A:A))","v":""}]
[null,{"$f":"IF(Konfiguration!B209=\"\",\"\",Konfiguration!B209)","v":""},null,null,null,{"$f":"IF(Konfiguration!B209=\"\",\"\",Konfiguration!C209)","v":""},{"$f":"IF(Konfiguration!B209=\"\",\"\",Konfiguration!D209)","v":""},null,null,null,{"$f":"IF(B219=\"\",\"\",SUMIF(Ausgaben!B:B,B219,Ausgaben!A:A))","v":""},{"$f":"IF(B219=\"\",\"\",SUMIF(Einnahmen!B:B,B219,Einnahmen!A:A))","v":""}]
[null,{"$f":"IF(Konfiguration!B210=\"\",\"\",Konfiguration!B210)","v":""},null,null,null,{"$f":"IF(Konfiguration!B210=\"\",\"\",Konfiguration!C210)","v":""},{"$f":"IF(Konfiguration!B210=\"\",\"\",Konfiguration!D210)","v":""},null,null,null,{"$f":"IF(B220=\"\",\"\",SUMIF(Ausgaben!B:B,B220,Ausgaben!A:A))","v":""},{"$f":"IF(B220=\"\",\"\",SUMIF(Einnahmen!B:B,B220,Einnahmen!A:A))","v":""}]
[null,{"$f":"IF(Konfiguration!B211=\"\",\"\",Konfiguration!B211)","v":""},null,null,null,{"$f":"IF(Konfiguration!B211=\"\",\"\",Konfiguration!C211)","v":""},{"$f":"IF(Konfiguration!B211=\"\",\"\",Konfiguration!D211)","v":""},null,null,null,{"$f":"IF(B221=\"\",\"\",SUMIF(Ausgaben!B:B,B221,Ausgaben!A:A))","v":""},{"$f":"IF(B221=\"\",\"\",SUMIF(Einnahmen!B:B,B221,Einnahmen!A:A))","v":""}]
[null,{"$f":"IF(Konfiguration!B212=\"\",\"\",Konfiguration!B212)","v":""},null,null,null,{"$f":"IF(Konfiguration!B212=\"\",\"\",Konfiguration!C212)","v":""},{"$f":"IF(Konfiguration!B212=\"\",\"\",Konfiguration!D212)","v":""},null,null,null,{"$f":"IF(B222=\"\",\"\",SUMIF(Ausgaben!B:B,B222,Ausgaben!A:A))","v":""},{"$f":"IF(B222=\"\",\"\",SUMIF(Einnahmen!B:B,B222,Einnahmen!A:A))","v":""}]
[null,{"$f":"IF(Konfiguration!B213=\"\",\"\",Konfiguration!B213)","v":""},null,null,null,{"$f":"IF(Konfiguration!B213=\"\",\"\",Konfiguration!C213)","v":""},{"$f":"IF(Konfiguration!B213=\"\",\"\",Konfiguration!D213)","v":""},null,null,null,{"$f":"IF(B223=\"\",\"\",SUMIF(Ausgaben!B:B,B223,Ausgaben!A:A))","v":""},{"$f":"IF(B223=\"\",\"\",SUMIF(Einnahmen!B:B,B223,Einnahmen!A:A))","v":""}]
[null,{"$f":"IF(Konfiguration!B214=\"\",\"\",Konfiguration!B214)","v":""},null,null,null,{"$f":"IF(Konfiguration!B214=\"\",\"\",Konfiguration!C214)","v":""},{"$f":"IF(Konfiguration!B214=\"\",\"\",Konfiguration!D214)","v":""},null,null,null,{"$f":"IF(B224=\"\",\"\",SUMIF(Ausgaben!B:B,B224,Ausgaben!A:A))","v":""},{"$f":"IF(B224=\"\",\"\",SUMIF(Einnahmen!B:B,B224,Einnahmen!A:A))","v":""}]
[null,{"$f":"IF(Konfiguration!B215=\"\",\"\",Konfiguration!B215)","v":""},null,null,null,{"$f":"IF(Konfiguration!B215=\"\",\"\",Konfiguration!C215)","v":""},{"$f":"IF(Konfiguration!B215=\"\",\"\",Konfiguration!D215)","v":""},null,null,null,{"$f":"IF(B225=\"\",\"\",SUMIF(Ausgaben!B:B,B225,Ausgaben!A:A))","v":""},{"$f":"IF(B225=\"\",\"\",SUMIF(Einnahmen!B:B,B225,Einnahmen!A:A))","v":""}]
[null,{"$f":"IF(Konfiguration!B216=\"\",\"\",Konfiguration!B216)","v":""},null,null,null,{"$f":"IF(Konfiguration!B216=\"\",\"\",Konfiguration!C216)","v":""},{"$f":"IF(Konfiguration!B216=\"\",\"\",Konfiguration!D216)","v":""},null,null,null,{"$f":"IF(B226=\"\",\"\",SUMIF(Ausgaben!B:B,B226,Ausgaben!A:A))","v":""},{"$f":"IF(B226=\"\",\"\",SUMIF(Einnahmen!B:B,B226,Einnahmen!A:A))","v":""}]
[null,{"$f":"IF(Konfiguration!B217=\"\",\"\",Konfiguration!B217)","v":""},null,null,null,{"$f":"IF(Konfiguration!B217=\"\",\"\",Konfiguration!C217)","v":""},{"$f":"IF(Konfiguration!B217=\"\",\"\",Konfiguration!D217)","v":""},null,null,null,{"$f":"IF(B227=\"\",\"\",SUMIF(Ausgaben!B:B,B227,Ausgaben!A:A))","v":""},{"$f":"IF(B227=\"\",\"\",SUMIF(Einnahmen!B:B,B227,Einnahmen!A:A))","v":""}]
[null,{"$f":"IF(Konfiguration!B218=\"\",\"\",Konfiguration!B218)","v":""},null,null,null,{"$f":"IF(Konfiguration!B218=\"\",\"\",Konfiguration!C218)","v":""},{"$f":"IF(Konfiguration!B218=\"\",\"\",Konfiguration!D218)","v":""},null,null,null,{"$f":"IF(B228=\"\",\"\",SUMIF(Ausgaben!B:B,B228,Ausgaben!A:A))","v":""},{"$f":"IF(B228=\"\",\"\",SUMIF(Einnahmen!B:B,B228,Einnahmen!A:A))","v":""}]
[null,{"$f":"IF(Konfiguration!B219=\"\",\"\",Konfiguration!B219)","v":""},null,null,null,{"$f":"IF(Konfiguration!B219=\"\",\"\",Konfiguration!C219)","v":""},{"$f":"IF(Konfiguration!B219=\"\",\"\",Konfiguration!D219)","v":""},null,null,null,{"$f":"IF(B229=\"\",\"\",SUMIF(Ausgaben!B:B,B229,Ausgaben!A:A))","v":""},{"$f":"IF(B229=\"\",\"\",SUMIF(Einnahmen!B:B,B229,Einnahmen!A:A))","v":""}]
[null,{"$f":"IF(Konfiguration!B220=\"\",\"\",Konfiguration!B220)","v":""},null,null,null,{"$f":"IF(Konfiguration!B220=\"\",\"\",Konfiguration!C220)","v":""},{"$f":"IF(Konfiguration!B220=\"\",\"\",Konfiguration!D220)","v":""},null,null,null,{"$f":"IF(B230=\"\",\"\",SUMIF(Ausgaben!B:B,B230,Ausgaben!A:A))","v":""},{"$f":"IF(B230=\"\",\"\",SUMIF(Einnahmen!B:B,B230,Einnahmen!A:A))","v":""}]
[null,{"$f":"IF(Konfiguration!B221=\"\",\"\",Konfiguration!B221)","v":""},null,null,null,{"$f":"IF(Konfiguration!B221=\"\",\"\",Konfiguration!C221)","v":""},{"$f":"IF(Konfiguration!B221=\"\",\"\",Konfiguration!D221)","v":""},null,null,null,{"$f":"IF(B231=\"\",\"\",SUMIF(Ausgaben!B:B,B231,Ausgaben!A:A))","v":""},{"$f":"IF(B231=\"\",\"\",SUMIF(Einnahmen!B:B,B231,Einnahmen!A:A))","v":""}]
[null,{"$f":"IF(Konfiguration!B222=\"\",\"\",Konfiguration!B222)","v":""},null,null,null,{"$f":"IF(Konfiguration!B222=\"\",\"\",Konfiguration!C222)","v":""},{"$f":"IF(Konfiguration!B222=\"\",\"\",Konfiguration!D222)","v":""},null,null,null,{"$f":"IF(B232=\"\",\"\",SUMIF(Ausgaben!B:B,B232,Ausgaben!A:A))","v":""},{"$f":"IF(B232=\"\",\"\",SUMIF(Einnahmen!B:B,B232,Einnahmen!A:A))","v":""}]
[null,{"$f":"IF(Konfiguration!B223=\"\",\"\",Konfiguration!B223)","v":""},null,null,null,{"$f":"IF(Konfiguration!B223=\"\",\"\",Konfiguration!C223)","v":""},{"$f":"IF(Konfiguration!B223=\"\",\"\",Konfiguration!D223)","v":""},null,null,null,{"$f":"IF(B233=\"\",\"\",SUMIF(Ausgaben!B:B,B233,Ausgaben!A:A))","v":""},{"$f":"IF(B233=\"\",\"\",SUMIF(Einnahmen!B:B,B233,Einnahmen!A:A))","v":""}]
[null,{"$f":"IF(Konfiguration!B224=\"\",\"\",Konfiguration!B224)","v":""},null,null,null,{"$f":"IF(Konfiguration!B224=\"\",\"\",Konfiguration!C224)","v":""},{"$f":"IF(Konfiguration!B224=\"\",\"\",Konfiguration!D224)","v":""},null,null,null,{"$f":"IF(B234=\"\",\"\",SUMIF(Ausgaben!B:B,B234,Ausgaben!A:A))","v":""},{"$f":"IF(B234=\"\",\"\",SUMIF(Einnahmen!B:B,B234,Einnahmen!A:A))","v":""}]
[null,{"$f":"IF(Konfiguration!B225=\"\",\"\",Konfiguration!B225)","v":""},null,null,null,{"$f":"IF(Konfiguration!B225=\"\",\"\",Konfiguration!C225)","v":""},{"$f":"IF(Konfiguration!B225=\"\",\"\",Konfiguration!D225)","v":""},null,null,null,{"$f":"IF(B235=\"\",\"\",SUMIF(Ausgaben!B:B,B235,Ausgaben!A:A))","v":""},{"$f":"IF(B235=\"\",\"\",SUMIF(Einnahmen!B:B,B235,Einnahmen!A:A))","v":""}]
[null,{"$f":"IF(Konfiguration!B226=\"\",\"\",Konfiguration!B226)","v":""},null,null,null,{"$f":"IF(Konfiguration!B226=\"\",\"\",Konfiguration!C226)","v":""},{"$f":"IF(Konfiguration!B226=\"\",\"\",Konfiguration!D226)","v":""},null,null,null,{"$f":"IF(B236=\"\",\"\",SUMIF(Ausgaben!B:B,B236,Ausgaben!A:A))","v":""},{"$f":"IF(B236=\"\",\"\",SUMIF(Einnahmen!B:B,B236,Einnahmen!A:A))","v":""}]
[null,{"$f":"IF(Konfiguration!B227=\"\",\"\",Konfiguration!B227)","v":""},null,null,null,{"$f":"IF(Konfiguration!B227=\"\",\"\",Konfiguration!C227)","v":""},{"$f":"IF(Konfiguration!B227=\"\",\"\",Konfiguration!D227)","v":""},null,null,null,{"$f":"IF(B237=\"\",\"\",SUMIF(Ausgaben!B:B,B237,Ausgaben!A:A))","v":""},{"$f":"IF(B237=\"\",\"\",SUMIF(Einnahmen!B:B,B237,Einnahmen!A:A))","v":""}]
[null,{"$f":"IF(Konfiguration!B228=\"\",\"\",Konfiguration!B228)","v":""},null,null,null,{"$f":"IF(Konfiguration!B228=\"\",\"\",Konfiguration!C228)","v":""},{"$f":"IF(Konfiguration!B228=\"\",\"\",Konfiguration!D228)","v":""},null,null,null,{"$f":"IF(B238=\"\",\"\",SUMIF(Ausgaben!B:B,B238,Ausgaben!A:A))","v":""},{"$f":"IF(B238=\"\",\"\",SUMIF(Einnahmen!B:B,B238,Einnahmen!A:A))","v":""}]
[null,{"$f":"IF(Konfiguration!B229=\"\",\"\",Konfiguration!B229)","v":""},null,null,null,{"$f":"IF(Konfiguration!B229=\"\",\"\",Konfiguration!C229)","v":""},{"$f":"IF(Konfiguration!B229=\"\",\"\",Konfiguration!D229)","v":""},null,null,null,{"$f":"IF(B239=\"\",\"\",SUMIF(Ausgaben!B:B,B239,Ausgaben!A:A))","v":""},{"$f":"IF(B239=\"\",\"\",SUMIF(Einnahmen!B:B,B239,Einnahmen!A:A))","v":""}]
[null,{"$f":"IF(Konfiguration!B230=\"\",\"\",Konfiguration!B230)","v":""},null,null,null,{"$f":"IF(Konfiguration!B230=\"\",\"\",Konfiguration!C230)","v":""},{"$f":"IF(Konfiguration!B230=\"\",\"\",Konfiguration!D230)","v":""},null,null,null,{"$f":"IF(B240=\"\",\"\",SUMIF(Ausgaben!B:B,B240,Ausgaben!A:A))","v":""},{"$f":"IF(B240=\"\",\"\",SUMIF(Einnahmen!B:B,B240,Einnahmen!A:A))","v":""}]
[null,{"$f":"IF(Konfiguration!B231=\"\",\"\",Konfiguration!B231)","v":""},null,null,null,{"$f":"IF(Konfiguration!B231=\"\",\"\",Konfiguration!C231)","v":""},{"$f":"IF(Konfiguration!B231=\"\",\"\",Konfiguration!D231)","v":""},null,null,null,{"$f":"IF(B241=\"\",\"\",SUMIF(Ausgaben!B:B,B241,Ausgaben!A:A))","v":""},{"$f":"IF(B241=\"\",\"\",SUMIF(Einnahmen!B:B,B241,Einnahmen!A:A))","v":""}]
[null,{"$f":"IF(Konfiguration!B232=\"\",\"\",Konfiguration!B232)","v":""},null,null,null,{"$f":"IF(Konfiguration!B232=\"\",\"\",Konfiguration!C232)","v":""},{"$f":"IF(Konfiguration!B232=\"\",\"\",Konfiguration!D232)","v":""},null,null,null,{"$f":"IF(B242=\"\",\"\",SUMIF(Ausgaben!B:B,B242,Ausgaben!A:A))","v":""},{"$f":"IF(B242=\"\",\"\",SUMIF(Einnahmen!B:B,B242,Einnahmen!A:A))","v":""}]
[null,{"$f":"IF(Konfiguration!B233=\"\",\"\",Konfiguration!B233)","v":""},null,null,null,{"$f":"IF(Konfiguration!B233=\"\",\"\",Konfiguration!C233)","v":""},{"$f":"IF(Konfiguration!B233=\"\",\"\",Konfiguration!D233)","v":""},null,null,null,{"$f":"IF(B243=\"\",\"\",SUMIF(Ausgaben!B:B,B243,Ausgaben!A:A))","v":""},{"$f":"IF(B243=\"\",\"\",SUMIF(Einnahmen!B:B,B243,Einnahmen!A:A))","v":""}]
[null,{"$f":"IF(Konfiguration!B234=\"\",\"\",Konfiguration!B234)","v":""},null,null,null,{"$f":"IF(Konfiguration!B234=\"\",\"\",Konfiguration!C234)","v":""},{"$f":"IF(Konfiguration!B234=\"\",\"\",Konfiguration!D234)","v":""},null,null,null,{"$f":"IF(B244=\"\",\"\",SUMIF(Ausgaben!B:B,B244,Ausgaben!A:A))","v":""},{"$f":"IF(B244=\"\",\"\",SUMIF(Einnahmen!B:B,B244,Einnahmen!A:A))","v":""}]
[null,{"$f":"IF(Konfiguration!B235=\"\",\"\",Konfiguration!B235)","v":""},null,null,null,{"$f":"IF(Konfiguration!B235=\"\",\"\",Konfiguration!C235)","v":""},{"$f":"IF(Konfiguration!B235=\"\",\"\",Konfiguration!D235)","v":""},null,null,null,{"$f":"IF(B245=\"\",\"\",SUMIF(Ausgaben!B:B,B245,Ausgaben!A:A))","v":""},{"$f":"IF(B245=\"\",\"\",SUMIF(Einnahmen!B:B,B245,Einnahmen!A:A))","v":""}]
[null,{"$f":"IF(Konfiguration!B236=\"\",\"\",Konfiguration!B236)","v":""},null,null,null,{"$f":"IF(Konfiguration!B236=\"\",\"\",Konfiguration!C236)","v":""},{"$f":"IF(Konfiguration!B236=\"\",\"\",Konfiguration!D236)","v":""},null,null,null,{"$f":"IF(B246=\"\",\"\",SUMIF(Ausgaben!B:B,B246,Ausgaben!A:A))","v":""},{"$f":"IF(B246=\"\",\"\",SUMIF(Einnahmen!B:B,B246,Einnahmen!A:A))","v":""}]
[null,{"$f":"IF(Konfiguration!B237=\"\",\"\",Konfiguration!B237)","v":""},null,null,null,{"$f":"IF(Konfiguration!B237=\"\",\"\",Konfiguration!C237)","v":""},{"$f":"IF(Konfiguration!B237=\"\",\"\",Konfiguration!D237)","v":""},null,null,null,{"$f":"IF(B247=\"\",\"\",SUMIF(Ausgaben!B:B,B247,Ausgaben!A:A))","v":""},{"$f":"IF(B247=\"\",\"\",SUMIF(Einnahmen!B:B,B247,Einnahmen!A:A))","v":""}]
[null,{"$f":"IF(Konfiguration!B238=\"\",\"\",Konfiguration!B238)","v":""},null,null,null,{"$f":"IF(Konfiguration!B238=\"\",\"\",Konfiguration!C238)","v":""},{"$f":"IF(Konfiguration!B238=\"\",\"\",Konfiguration!D238)","v":""},null,null,null,{"$f":"IF(B248=\"\",\"\",SUMIF(Ausgaben!B:B,B248,Ausgaben!A:A))","v":""},{"$f":"IF(B248=\"\",\"\",SUMIF(Einnahmen!B:B,B248,Einnahmen!A:A))","v":""}]
[null,{"$f":"IF(Konfiguration!B239=\"\",\"\",Konfiguration!B239)","v":""},null,null,null,{"$f":"IF(Konfiguration!B239=\"\",\"\",Konfiguration!C239)","v":""},{"$f":"IF(Konfiguration!B239=\"\",\"\",Konfiguration!D239)","v":""},null,null,null,{"$f":"IF(B249=\"\",\"\",SUMIF(Ausgaben!B:B,B249,Ausgaben!A:A))","v":""},{"$f":"IF(B249=\"\",\"\",SUMIF(Einnahmen!B:B,B249,Einnahmen!A:A))","v":""}]
[null,{"$f":"IF(Konfiguration!B240=\"\",\"\",Konfiguration!B240)","v":""},null,null,null,{"$f":"IF(Konfiguration!B240=\"\",\"\",Konfiguration!C240)","v":""},{"$f":"IF(Konfiguration!B240=\"\",\"\",Konfiguration!D240)","v":""},null,null,null,{"$f":"IF(B250=\"\",\"\",SUMIF(Ausgaben!B:B,B250,Ausgaben!A:A))","v":""},{"$f":"IF(B250=\"\",\"\",SUMIF(Einnahmen!B:B,B250,Einnahmen!A:A))","v":""}]
[null,{"$f":"IF(Konfiguration!B241=\"\",\"\",Konfiguration!B241)","v":""},null,null,null,{"$f":"IF(Konfiguration!B241=\"\",\"\",Konfiguration!C241)","v":""},{"$f":"IF(Konfiguration!B241=\"\",\"\",Konfiguration!D241)","v":""},null,null,null,{"$f":"IF(B251=\"\",\"\",SUMIF(Ausgaben!B:B,B251,Ausgaben!A:A))","v":""},{"$f":"IF(B251=\"\",\"\",SUMIF(Einnahmen!B:B,B251,Einnahmen!A:A))","v":""}]
[null,{"$f":"IF(Konfiguration!B242=\"\",\"\",Konfiguration!B242)","v":""},null,null,null,{"$f":"IF(Konfiguration!B242=\"\",\"\",Konfiguration!C242)","v":""},{"$f":"IF(Konfiguration!B242=\"\",\"\",Konfiguration!D242)","v":""},null,null,null,{"$f":"IF(B252=\"\",\"\",SUMIF(Ausgaben!B:B,B252,Ausgaben!A:A))","v":""},{"$f":"IF(B252=\"\",\"\",SUMIF(Einnahmen!B:B,B252,Einnahmen!A:A))","v":""}]
[null,{"$f":"IF(Konfiguration!B243=\"\",\"\",Konfiguration!B243)","v":""},null,null,null,{"$f":"IF(Konfiguration!B243=\"\",\"\",Konfiguration!C243)","v":""},{"$f":"IF(Konfiguration!B243=\"\",\"\",Konfiguration!D243)","v":""},null,null,null,{"$f":"IF(B253=\"\",\"\",SUMIF(Ausgaben!B:B,B253,Ausgaben!A:A))","v":""},{"$f":"IF(B253=\"\",\"\",SUMIF(Einnahmen!B:B,B253,Einnahmen!A:A))","v":""}]
[null,{"$f":"IF(Konfiguration!B244=\"\",\"\",Konfiguration!B244)","v":""},null,null,null,{"$f":"IF(Konfiguration!B244=\"\",\"\",Konfiguration!C244)","v":""},{"$f":"IF(Konfiguration!B244=\"\",\"\",Konfiguration!D244)","v":""},null,null,null,{"$f":"IF(B254=\"\",\"\",SUMIF(Ausgaben!B:B,B254,Ausgaben!A:A))","v":""},{"$f":"IF(B254=\"\",\"\",SUMIF(Einnahmen!B:B,B254,Einnahmen!A:A))","v":""}]
[null,{"$f":"IF(Konfiguration!B245=\"\",\"\",Konfiguration!B245)","v":""},null,null,null,{"$f":"IF(Konfiguration!B245=\"\",\"\",Konfiguration!C245)","v":""},{"$f":"IF(Konfiguration!B245=\"\",\"\",Konfiguration!D245)","v":""},null,null,null,{"$f":"IF(B255=\"\",\"\",SUMIF(Ausgaben!B:B,B255,Ausgaben!A:A))","v":""},{"$f":"IF(B255=\"\",\"\",SUMIF(Einnahmen!B:B,B255,Einnahmen!A:A))","v":""}]
[null,{"$f":"IF(Konfiguration!B246=\"\",\"\",Konfiguration!B246)","v":""},null,null,null,{"$f":"IF(Konfiguration!B246=\"\",\"\",Konfiguration!C246)","v":""},{"$f":"IF(Konfiguration!B246=\"\",\"\",Konfiguration!D246)","v":""},null,null,null,{"$f":"IF(B256=\"\",\"\",SUMIF(Ausgaben!B:B,B256,Ausgaben!A:A))","v":""},{"$f":"IF(B256=\"\",\"\",SUMIF(Einnahmen!B:B,B256,Einnahmen!A:A))","v":""}]
[null,{"$f":"IF(Konfiguration!B247=\"\",\"\",Konfiguration!B247)","v":""},null,null,null,{"$f":"IF(Konfiguration!B247=\"\",\"\",Konfiguration!C247)","v":""},{"$f":"IF(Konfiguration!B247=\"\",\"\",Konfiguration!D247)","v":""},null,null,null,{"$f":"IF(B257=\"\",\"\",SUMIF(Ausgaben!B:B,B257,Ausgaben!A:A))","v":""},{"$f":"IF(B257=\"\",\"\",SUMIF(Einnahmen!B:B,B257,Einnahmen!A:A))","v":""}]
[null,{"$f":"IF(Konfiguration!B248=\"\",\"\",Konfiguration!B248)","v":""},null,null,null,{"$f":"IF(Konfiguration!B248=\"\",\"\",Konfiguration!C248)","v":""},{"$f":"IF(Konfiguration!B248=\"\",\"\",Konfiguration!D248)","v":""},null,null,null,{"$f":"IF(B258=\"\",\"\",SUMIF(Ausgaben!B:B,B258,Ausgaben!A:A))","v":""},{"$f":"IF(B258=\"\",\"\",SUMIF(Einnahmen!B:B,B258,Einnahmen!A:A))","v":""}]
[null,{"$f":"IF(Konfiguration!B249=\"\",\"\",Konfiguration!B249)","v":""},null,null,null,{"$f":"IF(Konfiguration!B249=\"\",\"\",Konfiguration!C249)","v":""},{"$f":"IF(Konfiguration!B249=\"\",\"\",Konfiguration!D249)","v":""},null,null,null,{"$f":"IF(B259=\"\",\"\",SUMIF(Ausgaben!B:B,B259,Ausgaben!A:A))","v":""},{"$f":"IF(B259=\"\",\"\",SUMIF(Einnahmen!B:B,B259,Einnahmen!A:A))","v":""}]
[null,{"$f":"IF(Konfiguration!B250=\"\",\"\",Konfiguration!B250)","v":""},null,null,null,{"$f":"IF(Konfiguration!B250=\"\",\"\",Konfiguration!C250)","v":""},{"$f":"IF(Konfiguration!B250=\"\",\"\",Konfiguration!D250)","v":""},null,null,null,{"$f":"IF(B260=\"\",\"\",SUMIF(Ausgaben!B:B,B260,Ausgaben!A:A))","v":""},{"$f":"IF(B260=\"\",\"\",SUMIF(Einnahmen!B:B,B260,Einnahmen!A:A))","v":""}]
[null,{"$f":"IF(Konfiguration!B251=\"\",\"\",Konfiguration!B251)","v":""},null,null,null,{"$f":"IF(Konfiguration!B251=\"\",\"\",Konfiguration!C251)","v":""},{"$f":"IF(Konfiguration!B251=\"\",\"\",Konfiguration!D251)","v":""},null,null,null,{"$f":"IF(B261=\"\",\"\",SUMIF(Ausgaben!B:B,B261,Ausgaben!A:A))","v":""},{"$f":"IF(B261=\"\",\"\",SUMIF(Einnahmen!B:B,B261,Einnahmen!A:A))","v":""}]
[null,{"$f":"IF(Konfiguration!B252=\"\",\"\",Konfiguration!B252)","v":""},null,null,null,{"$f":"IF(Konfiguration!B252=\"\",\"\",Konfiguration!C252)","v":""},{"$f":"IF(Konfiguration!B252=\"\",\"\",Konfiguration!D252)","v":""},null,null,null,{"$f":"IF(B262=\"\",\"\",SUMIF(Ausgaben!B:B,B262,Ausgaben!A:A))","v":""},{"$f":"IF(B262=\"\",\"\",SUMIF(Einnahmen!B:B,B262,Einnahmen!A:A))","v":""}]
[null,{"$f":"IF(Konfiguration!B253=\"\",\"\",Konfiguration!B253)","v":""},null,null,null,{"$f":"IF(Konfiguration!B253=\"\",\"\",Konfiguration!C253)","v":""},{"$f":"IF(Konfiguration!B253=\"\",\"\",Konfiguration!D253)","v":""},null,null,null,{"$f":"IF(B263=\"\",\"\",SUMIF(Ausgaben!B:B,B263,Ausgaben!A:A))","v":""},{"$f":"IF(B263=\"\",\"\",SUMIF(Einnahmen!B:B,B263,Einnahmen!A:A))","v":""}]
[null,{"$f":"IF(Konfiguration!B254=\"\",\"\",Konfiguration!B254)","v":""},null,null,null,{"$f":"IF(Konfiguration!B254=\"\",\"\",Konfiguration!C254)","v":""},{"$f":"IF(Konfiguration!B254=\"\",\"\",Konfiguration!D254)","v":""},null,null,null,{"$f":"IF(B264=\"\",\"\",SUMIF(Ausgaben!B:B,B264,Ausgaben!A:A))","v":""},{"$f":"IF(B264=\"\",\"\",SUMIF(Einnahmen!B:B,B264,Einnahmen!A:A))","v":""}]
[null,{"$f":"IF(Konfiguration!B255=\"\",\"\",Konfiguration!B255)","v":""},null,null,null,{"$f":"IF(Konfiguration!B255=\"\",\"\",Konfiguration!C255)","v":""},{"$f":"IF(Konfiguration!B255=\"\",\"\",Konfiguration!D255)","v":""},null,null,null,{"$f":"IF(B265=\"\",\"\",SUMIF(Ausgaben!B:B,B265,Ausgaben!A:A))","v":""},{"$f":"IF(B265=\"\",\"\",SUMIF(Einnahmen!B:B,B265,Einnahmen!A:A))","v":""}]
[null,{"$f":"IF(Konfiguration!B256=\"\",\"\",Konfiguration!B256)","v":""},null,null,null,{"$f":"IF(Konfiguration!B256=\"\",\"\",Konfiguration!C256)","v":""},{"$f":"IF(Konfiguration!B256=\"\",\"\",Konfiguration!D256)","v":""},null,null,null,{"$f":"IF(B266=\"\",\"\",SUMIF(Ausgaben!B:B,B266,Ausgaben!A:A))","v":""},{"$f":"IF(B266=\"\",\"\",SUMIF(Einnahmen!B:B,B266,Einnahmen!A:A))","v":""}]
[null,{"$f":"IF(Konfiguration!B257=\"\",\"\",Konfiguration!B257)","v":""},null,null,null,{"$f":"IF(Konfiguration!B257=\"\",\"\",Konfiguration!C257)","v":""},{"$f":"IF(Konfiguration!B257=\"\",\"\",Konfiguration!D257)","v":""},null,null,null,{"$f":"IF(B267=\"\",\"\",SUMIF(Ausgaben!B:B,B267,Ausgaben!A:A))","v":""},{"$f":"IF(B267=\"\",\"\",SUMIF(Einnahmen!B:B,B267,Einnahmen!A:A))","v":""}]
[null,{"$f":"IF(Konfiguration!B258=\"\",\"\",Konfiguration!B258)","v":""},null,null,null,{"$f":"IF(Konfiguration!B258=\"\",\"\",Konfiguration!C258)","v":""},{"$f":"IF(Konfiguration!B258=\"\",\"\",Konfiguration!D258)","v":""},null,null,null,{"$f":"IF(B268=\"\",\"\",SUMIF(Ausgaben!B:B,B268,Ausgaben!A:A))","v":""},{"$f":"IF(B268=\"\",\"\",SUMIF(Einnahmen!B:B,B268,Einnahmen!A:A))","v":""}]
[null,{"$f":"IF(Konfiguration!B259=\"\",\"\",Konfiguration!B259)","v":""},null,null,null,{"$f":"IF(Konfiguration!B259=\"\",\"\",Konfiguration!C259)","v":""},{"$f":"IF(Konfiguration!B259=\"\",\"\",Konfiguration!D259)","v":""},null,null,null,{"$f":"IF(B269=\"\",\"\",SUMIF(Ausgaben!B:B,B269,Ausgaben!A:A))","v":""},{"$f":"IF(B269=\"\",\"\",SUMIF(Einnahmen!B:B,B269,Einnahmen!A:A))","v":""}]
[null,{"$f":"IF(Konfiguration!B260=\"\",\"\",Konfiguration!B260)","v":""},null,null,null,{"$f":"IF(Konfiguration!B260=\"\",\"\",Konfiguration!C260)","v":""},{"$f":"IF(Konfiguration!B260=\"\",\"\",Konfiguration!D260)","v":""},null,null,null,{"$f":"IF(B270=\"\",\"\",SUMIF(Ausgaben!B:B,B270,Ausgaben!A:A))","v":""},{"$f":"IF(B270=\"\",\"\",SUMIF(Einnahmen!B:B,B270,Einnahmen!A:A))","v":""}]
[null,{"$f":"IF(Konfiguration!B261=\"\",\"\",Konfiguration!B261)","v":""},null,null,null,{"$f":"IF(Konfiguration!B261=\"\",\"\",Konfiguration!C261)","v":""},{"$f":"IF(Konfiguration!B261=\"\",\"\",Konfiguration!D261)","v":""},null,null,null,{"$f":"IF(B271=\"\",\"\",SUMIF(Ausgaben!B:B,B271,Ausgaben!A:A))","v":""},{"$f":"IF(B271=\"\",\"\",SUMIF(Einnahmen!B:B,B271,Einnahmen!A:A))","v":""}]
[null,{"$f":"IF(Konfiguration!B262=\"\",\"\",Konfiguration!B262)","v":""},null,null,null,{"$f":"IF(Konfiguration!B262=\"\",\"\",Konfiguration!C262)","v":""},{"$f":"IF(Konfiguration!B262=\"\",\"\",Konfiguration!D262)","v":""},null,null,null,{"$f":"IF(B272=\"\",\"\",SUMIF(Ausgaben!B:B,B272,Ausgaben!A:A))","v":""},{"$f":"IF(B272=\"\",\"\",SUMIF(Einnahmen!B:B,B272,Einnahmen!A:A))","v":""}]
[null,{"$f":"IF(Konfiguration!B263=\"\",\"\",Konfiguration!B263)","v":""},null,null,null,{"$f":"IF(Konfiguration!B263=\"\",\"\",Konfiguration!C263)","v":""},{"$f":"IF(Konfiguration!B263=\"\",\"\",Konfiguration!D263)","v":""},null,null,null,{"$f":"IF(B273=\"\",\"\",SUMIF(Ausgaben!B:B,B273,Ausgaben!A:A))","v":""},{"$f":"IF(B273=\"\",\"\",SUMIF(Einnahmen!B:B,B273,Einnahmen!A:A))","v":""}]
[null,{"$f":"IF(Konfiguration!B264=\"\",\"\",Konfiguration!B264)","v":""},null,null,null,{"$f":"IF(Konfiguration!B264=\"\",\"\",Konfiguration!C264)","v":""},{"$f":"IF(Konfiguration!B264=\"\",\"\",Konfiguration!D264)","v":""},null,null,null,{"$f":"IF(B274=\"\",\"\",SUMIF(Ausgaben!B:B,B274,Ausgaben!A:A))","v":""},{"$f":"IF(B274=\"\",\"\",SUMIF(Einnahmen!B:B,B274,Einnahmen!A:A))","v":""}]
[null,{"$f":"IF(Konfiguration!B265=\"\",\"\",Konfiguration!B265)","v":""},null,null,null,{"$f":"IF(Konfiguration!B265=\"\",\"\",Konfiguration!C265)","v":""},{"$f":"IF(Konfiguration!B265=\"\",\"\",Konfiguration!D265)","v":""},null,null,null,{"$f":"IF(B275=\"\",\"\",SUMIF(Ausgaben!B:B,B275,Ausgaben!A:A))","v":""},{"$f":"IF(B275=\"\",\"\",SUMIF(Einnahmen!B:B,B275,Einnahmen!A:A))","v":""}]
[null,{"$f":"IF(Konfiguration!B266=\"\",\"\",Konfiguration!B266)","v":""},null,null,null,{"$f":"IF(Konfiguration!B266=\"\",\"\",Konfiguration!C266)","v":""},{"$f":"IF(Konfiguration!B266=\"\",\"\",Konfiguration!D266)","v":""},null,null,null,{"$f":"IF(B276=\"\",\"\",SUMIF(Ausgaben!B:B,B276,Ausgaben!A:A))","v":""},{"$f":"IF(B276=\"\",\"\",SUMIF(Einnahmen!B:B,B276,Einnahmen!A:A))","v":""}]
[null,{"$f":"IF(Konfiguration!B267=\"\",\"\",Konfiguration!B267)","v":""},null,null,null,{"$f":"IF(Konfiguration!B267=\"\",\"\",Konfiguration!C267)","v":""},{"$f":"IF(Konfiguration!B267=\"\",\"\",Konfiguration!D267)","v":""},null,null,null,{"$f":"IF(B277=\"\",\"\",SUMIF(Ausgaben!B:B,B277,Ausgaben!A:A))","v":""},{"$f":"IF(B277=\"\",\"\",SUMIF(Einnahmen!B:B,B277,Einnahmen!A:A))","v":""}]
[null,{"$f":"IF(Konfiguration!B268=\"\",\"\",Konfiguration!B268)","v":""},null,null,null,{"$f":"IF(Konfiguration!B268=\"\",\"\",Konfiguration!C268)","v":""},{"$f":"IF(Konfiguration!B268=\"\",\"\",Konfiguration!D268)","v":""},null,null,null,{"$f":"IF(B278=\"\",\"\",SUMIF(Ausgaben!B:B,B278,Ausgaben!A:A))","v":""},{"$f":"IF(B278=\"\",\"\",SUMIF(Einnahmen!B:B,B278,Einnahmen!A:A))","v":""}]
[null,{"$f":"IF(Konfiguration!B269=\"\",\"\",Konfiguration!B269)","v":""},null,null,null,{"$f":"IF(Konfiguration!B269=\"\",\"\",Konfiguration!C269)","v":""},{"$f":"IF(Konfiguration!B269=\"\",\"\",Konfiguration!D269)","v":""},null,null,null,{"$f":"IF(B279=\"\",\"\",SUMIF(Ausgaben!B:B,B279,Ausgaben!A:A))","v":""},{"$f":"IF(B279=\"\",\"\",SUMIF(Einnahmen!B:B,B279,Einnahmen!A:A))","v":""}]
[null,{"$f":"IF(Konfiguration!B270=\"\",\"\",Konfiguration!B270)","v":""},null,null,null,{"$f":"IF(Konfiguration!B270=\"\",\"\",Konfiguration!C270)","v":""},{"$f":"IF(Konfiguration!B270=\"\",\"\",Konfiguration!D270)","v":""},null,null,null,{"$f":"IF(B280=\"\",\"\",SUMIF(Ausgaben!B:B,B280,Ausgaben!A:A))","v":""},{"$f":"IF(B280=\"\",\"\",SUMIF(Einnahmen!B:B,B280,Einnahmen!A:A))","v":""}]
[null,{"$f":"IF(Konfiguration!B271=\"\",\"\",Konfiguration!B271)","v":""},null,null,null,{"$f":"IF(Konfiguration!B271=\"\",\"\",Konfiguration!C271)","v":""},{"$f":"IF(Konfiguration!B271=\"\",\"\",Konfiguration!D271)","v":""},null,null,null,{"$f":"IF(B281=\"\",\"\",SUMIF(Ausgaben!B:B,B281,Ausgaben!A:A))","v":""},{"$f":"IF(B281=\"\",\"\",SUMIF(Einnahmen!B:B,B281,Einnahmen!A:A))","v":""}]
[null,{"$f":"IF(Konfiguration!B272=\"\",\"\",Konfiguration!B272)","v":""},null,null,null,{"$f":"IF(Konfiguration!B272=\"\",\"\",Konfiguration!C272)","v":""},{"$f":"IF(Konfiguration!B272=\"\",\"\",Konfiguration!D272)","v":""},null,null,null,{"$f":"IF(B282=\"\",\"\",SUMIF(Ausgaben!B:B,B282,Ausgaben!A:A))","v":""},{"$f":"IF(B282=\"\",\"\",SUMIF(Einnahmen!B:B,B282,Einnahmen!A:A))","v":""}]
[null,{"$f":"IF(Konfiguration!B273=\"\",\"\",Konfiguration!B273)","v":""},null,null,null,{"$f":"IF(Konfiguration!B273=\"\",\"\",Konfiguration!C273)","v":""},{"$f":"IF(Konfiguration!B273=\"\",\"\",Konfiguration!D273)","v":""},null,null,null,{"$f":"IF(B283=\"\",\"\",SUMIF(Ausgaben!B:B,B283,Ausgaben!A:A))","v":""},{"$f":"IF(B283=\"\",\"\",SUMIF(Einnahmen!B:B,B283,Einnahmen!A:A))","v":""}]
[null,{"$f":"IF(Konfiguration!B274=\"\",\"\",Konfiguration!B274)","v":""},null,null,null,{"$f":"IF(Konfiguration!B274=\"\",\"\",Konfiguration!C274)","v":""},{"$f":"IF(Konfiguration!B274=\"\",\"\",Konfiguration!D274)","v":""},null,null,null,{"$f":"IF(B284=\"\",\"\",SUMIF(Ausgaben!B:B,B284,Ausgaben!A:A))","v":""},{"$f":"IF(B284=\"\",\"\",SUMIF(Einnahmen!B:B,B284,Einnahmen!A:A))","v":""}]
[null,{"$f":"IF(Konfiguration!B275=\"\",\"\",Konfiguration!B275)","v":""},null,null,null,{"$f":"IF(Konfiguration!B275=\"\",\"\",Konfiguration!C275)","v":""},{"$f":"IF(Konfiguration!B275=\"\",\"\",Konfiguration!D275)","v":""},null,null,null,{"$f":"IF(B285=\"\",\"\",SUMIF(Ausgaben!B:B,B285,Ausgaben!A:A))","v":""},{"$f":"IF(B285=\"\",\"\",SUMIF(Einnahmen!B:B,B285,Einnahmen!A:A))","v":""}]
[null,{"$f":"IF(Konfiguration!B276=\"\",\"\",Konfiguration!B276)","v":""},null,null,null,{"$f":"IF(Konfiguration!B276=\"\",\"\",Konfiguration!C276)","v":""},{"$f":"IF(Konfiguration!B276=\"\",\"\",Konfiguration!D276)","v":""},null,null,null,{"$f":"IF(B286=\"\",\"\",SUMIF(Ausgaben!B:B,B286,Ausgaben!A:A))","v":""},{"$f":"IF(B286=\"\",\"\",SUMIF(Einnahmen!B:B,B286,Einnahmen!A:A))","v":""}]
[null,{"$f":"IF(Konfiguration!B277=\"\",\"\",Konfiguration!B277)","v":""},null,null,null,{"$f":"IF(Konfiguration!B277=\"\",\"\",Konfiguration!C277)","v":""},{"$f":"IF(Konfiguration!B277=\"\",\"\",Konfiguration!D277)","v":""},null,null,null,{"$f":"IF(B287=\"\",\"\",SUMIF(Ausgaben!B:B,B287,Ausgaben!A:A))","v":""},{"$f":"IF(B287=\"\",\"\",SUMIF(Einnahmen!B:B,B287,Einnahmen!A:A))","v":""}]
[null,{"$f":"IF(Konfiguration!B278=\"\",\"\",Konfiguration!B278)","v":""},null,null,null,{"$f":"IF(Konfiguration!B278=\"\",\"\",Konfiguration!C278)","v":""},{"$f":"IF(Konfiguration!B278=\"\",\"\",Konfiguration!D278)","v":""},null,null,null,{"$f":"IF(B288=\"\",\"\",SUMIF(Ausgaben!B:B,B288,Ausgaben!A:A))","v":""},{"$f":"IF(B288=\"\",\"\",SUMIF(Einnahmen!B:B,B288,Einnahmen!A:A))","v":""}]
[null,{"$f":"IF(Konfiguration!B279=\"\",\"\",Konfiguration!B279)","v":""},null,null,null,{"$f":"IF(Konfiguration!B279=\"\",\"\",Konfiguration!C279)","v":""},{"$f":"IF(Konfiguration!B279=\"\",\"\",Konfiguration!D279)","v":""},null,null,null,{"$f":"IF(B289=\"\",\"\",SUMIF(Ausgaben!B:B,B289,Ausgaben!A:A))","v":""},{"$f":"IF(B289=\"\",\"\",SUMIF(Einnahmen!B:B,B289,Einnahmen!A:A))","v":""}]
[null,{"$f":"IF(Konfiguration!B280=\"\",\"\",Konfiguration!B280)","v":""},null,null,null,{"$f":"IF(Konfiguration!B280=\"\",\"\",Konfiguration!C280)","v":""},{"$f":"IF(Konfiguration!B280=\"\",\"\",Konfiguration!D280)","v":""},null,null,null,{"$f":"IF(B290=\"\",\"\",SUMIF(Ausgaben!B:B,B290,Ausgaben!A:A))","v":""},{"$f":"IF(B290=\"\",\"\",SUMIF(Einnahmen!B:B,B290,Einnahmen!A:A))","v":""}]
[null,{"$f":"IF(Konfiguration!B281=\"\",\"\",Konfiguration!B281)","v":""},null,null,null,{"$f":"IF(Konfiguration!B281=\"\",\"\",Konfiguration!C281)","v":""},{"$f":"IF(Konfiguration!B281=\"\",\"\",Konfiguration!D281)","v":""},null,null,null,{"$f":"IF(B291=\"\",\"\",SUMIF(Ausgaben!B:B,B291,Ausgaben!A:A))","v":""},{"$f":"IF(B291=\"\",\"\",SUMIF(Einnahmen!B:B,B291,Einnahmen!A:A))","v":""}]
[null,{"$f":"IF(Konfiguration!B282=\"\",\"\",Konfiguration!B282)","v":""},null,null,null,{"$f":"IF(Konfiguration!B282=\"\",\"\",Konfiguration!C282)","v":""},{"$f":"IF(Konfiguration!B282=\"\",\"\",Konfiguration!D282)","v":""},null,null,null,{"$f":"IF(B292=\"\",\"\",SUMIF(Ausgaben!B:B,B292,Ausgaben!A:A))","v":""},{"$f":"IF(B292=\"\",\"\",SUMIF(Einnahmen!B:B,B292,Einnahmen!A:A))","v":""}]
[null,{"$f":"IF(Konfiguration!B283=\"\",\"\",Konfiguration!B283)","v":""},null,null,null,{"$f":"IF(Konfiguration!B283=\"\",\"\",Konfiguration!C283)","v":""},{"$f":"IF(Konfiguration!B283=\"\",\"\",Konfiguration!D283)","v":""},null,null,null,{"$f":"IF(B293=\"\",\"\",SUMIF(Ausgaben!B:B,B293,Ausgaben!A:A))","v":""},{"$f":"IF(B293=\"\",\"\",SUMIF(Einnahmen!B:B,B293,Einnahmen!A:A))","v":""}]
[null,{"$f":"IF(Konfiguration!B284=\"\",\"\",Konfiguration!B284)","v":""},null,null,null,{"$f":"IF(Konfiguration!B284=\"\",\"\",Konfiguration!C284)","v":""},{"$f":"IF(Konfiguration!B284=\"\",\"\",Konfiguration!D284)","v":""},null,null,null,{"$f":"IF(B294=\"\",\"\",SUMIF(Ausgaben!B:B,B294,Ausgaben!A:A))","v":""},{"$f":"IF(B294=\"\",\"\",SUMIF(Einnahmen!B:B,B294,Einnahmen!A:A))","v":""}]
[null,{"$f":"IF(Konfiguration!B285=\"\",\"\",Konfiguration!B285)","v":""},null,null,null,{"$f":"IF(Konfiguration!B285=\"\",\"\",Konfiguration!C285)","v":""},{"$f":"IF(Konfiguration!B285=\"\",\"\",Konfiguration!D285)","v":""},null,null,null,{"$f":"IF(B295=\"\",\"\",SUMIF(Ausgaben!B:B,B295,Ausgaben!A:A))","v":""},{"$f":"IF(B295=\"\",\"\",SUMIF(Einnahmen!B:B,B295,Einnahmen!A:A))","v":""}]
[null,{"$f":"IF(Konfiguration!B286=\"\",\"\",Konfiguration!B286)","v":""},null,null,null,{"$f":"IF(Konfiguration!B286=\"\",\"\",Konfiguration!C286)","v":""},{"$f":"IF(Konfiguration!B286=\"\",\"\",Konfiguration!D286)","v":""},null,null,null,{"$f":"IF(B296=\"\",\"\",SUMIF(Ausgaben!B:B,B296,Ausgaben!A:A))","v":""},{"$f":"IF(B296=\"\",\"\",SUMIF(Einnahmen!B:B,B296,Einnahmen!A:A))","v":""}]
[null,{"$f":"IF(Konfiguration!B287=\"\",\"\",Konfiguration!B287)","v":""},null,null,null,{"$f":"IF(Konfiguration!B287=\"\",\"\",Konfiguration!C287)","v":""},{"$f":"IF(Konfiguration!B287=\"\",\"\",Konfiguration!D287)","v":""},null,null,null,{"$f":"IF(B297=\"\",\"\",SUMIF(Ausgaben!B:B,B297,Ausgaben!A:A))","v":""},{"$f":"IF(B297=\"\",\"\",SUMIF(Einnahmen!B:B,B297,Einnahmen!A:A))","v":""}]
[null,{"$f":"IF(Konfiguration!B288=\"\",\"\",Konfiguration!B288)","v":""},null,null,null,{"$f":"IF(Konfiguration!B288=\"\",\"\",Konfiguration!C288)","v":""},{"$f":"IF(Konfiguration!B288=\"\",\"\",Konfiguration!D288)","v":""},null,null,null,{"$f":"IF(B298=\"\",\"\",SUMIF(Ausgaben!B:B,B298,Ausgaben!A:A))","v":""},{"$f":"IF(B298=\"\",\"\",SUMIF(Einnahmen!B:B,B298,Einnahmen!A:A))","v":""}]
[null,{"$f":"IF(Konfiguration!B289=\"\",\"\",Konfiguration!B289)","v":""},null,null,null,{"$f":"IF(Konfiguration!B289=\"\",\"\",Konfiguration!C289)","v":""},{"$f":"IF(Konfiguration!B289=\"\",\"\",Konfiguration!D289)","v":""},null,null,null,{"$f":"IF(B299=\"\",\"\",SUMIF(Ausgaben!B:B,B299,Ausgaben!A:A))","v":""},{"$f":"IF(B299=\"\",\"\",SUMIF(Einnahmen!B:B,B299,Einnahmen!A:A))","v":""}]
[null,{"$f":"IF(Konfiguration!B290=\"\",\"\",Konfiguration!B290)","v":""},null,null,null,{"$f":"IF(Konfiguration!B290=\"\",\"\",Konfiguration!C290)","v":""},{"$f":"IF(Konfiguration!B290=\"\",\"\",Konfiguration!D290)","v":""},null,null,null,{"$f":"IF(B300=\"\",\"\",SUMIF(Ausgaben!B:B,B300,Ausgaben!A:A))","v":""},{"$f":"IF(B300=\"\",\"\",SUMIF(Einnahmen!B:B,B300,Einnahmen!A:A))","v":""}]
[null,{"$f":"IF(Konfiguration!B291=\"\",\"\",Konfiguration!B291)","v":""},null,null,null,{"$f":"IF(Konfiguration!B291=\"\",\"\",Konfiguration!C291)","v":""},{"$f":"IF(Konfiguration!B291=\"\",\"\",Konfiguration!D291)","v":""},null,null,null,{"$f":"IF(B301=\"\",\"\",SUMIF(Ausgaben!B:B,B301,Ausgaben!A:A))","v":""},{"$f":"IF(B301=\"\",\"\",SUMIF(Einnahmen!B:B,B301,Einnahmen!A:A))","v":""}]
[null,{"$f":"IF(Konfiguration!B292=\"\",\"\",Konfiguration!B292)","v":""},null,null,null,{"$f":"IF(Konfiguration!B292=\"\",\"\",Konfiguration!C292)","v":""},{"$f":"IF(Konfiguration!B292=\"\",\"\",Konfiguration!D292)","v":""},null,null,null,{"$f":"IF(B302=\"\",\"\",SUMIF(Ausgaben!B:B,B302,Ausgaben!A:A))","v":""},{"$f":"IF(B302=\"\",\"\",SUMIF(Einnahmen!B:B,B302,Einnahmen!A:A))","v":""}]
[null,{"$f":"IF(Konfiguration!B293=\"\",\"\",Konfiguration!B293)","v":""},null,null,null,{"$f":"IF(Konfiguration!B293=\"\",\"\",Konfiguration!C293)","v":""},{"$f":"IF(Konfiguration!B293=\"\",\"\",Konfiguration!D293)","v":""},null,null,null,{"$f":"IF(B303=\"\",\"\",SUMIF(Ausgaben!B:B,B303,Ausgaben!A:A))","v":""},{"$f":"IF(B303=\"\",\"\",SUMIF(Einnahmen!B:B,B303,Einnahmen!A:A))","v":""}]
[null,{"$f":"IF(Konfiguration!B294=\"\",\"\",Konfiguration!B294)","v":""},null,null,null,{"$f":"IF(Konfiguration!B294=\"\",\"\",Konfiguration!C294)","v":""},{"$f":"IF(Konfiguration!B294=\"\",\"\",Konfiguration!D294)","v":""},null,null,null,{"$f":"IF(B304=\"\",\"\",SUMIF(Ausgaben!B:B,B304,Ausgaben!A:A))","v":""},{"$f":"IF(B304=\"\",\"\",SUMIF(Einnahmen!B:B,B304,Einnahmen!A:A))","v":""}]
[null,{"$f":"IF(Konfiguration!B295=\"\",\"\",Konfiguration!B295)","v":""},null,null,null,{"$f":"IF(Konfiguration!B295=\"\",\"\",Konfiguration!C295)","v":""},{"$f":"IF(Konfiguration!B295=\"\",\"\",Konfiguration!D295)","v":""},null,null,null,{"$f":"IF(B305=\"\",\"\",SUMIF(Ausgaben!B:B,B305,Ausgaben!A:A))","v":""},{"$f":"IF(B305=\"\",\"\",SUMIF(Einnahmen!B:B,B305,Einnahmen!A:A))","v":""}]
[null,{"$f":"IF(Konfiguration!B296=\"\",\"\",Konfiguration!B296)","v":""},null,null,null,{"$f":"IF(Konfiguration!B296=\"\",\"\",Konfiguration!C296)","v":""},{"$f":"IF(Konfiguration!B296=\"\",\"\",Konfiguration!D296)","v":""},null,null,null,{"$f":"IF(B306=\"\",\"\",SUMIF(Ausgaben!B:B,B306,Ausgaben!A:A))","v":""},{"$f":"IF(B306=\"\",\"\",SUMIF(Einnahmen!B:B,B306,Einnahmen!A:A))","v":""}]
[null,{"$f":"IF(Konfiguration!B297=\"\",\"\",Konfiguration!B297)","v":""},null,null,null,{"$f":"IF(Konfiguration!B297=\"\",\"\",Konfiguration!C297)","v":""},{"$f":"IF(Konfiguration!B297=\"\",\"\",Konfiguration!D297)","v":""},null,null,null,{"$f":"IF(B307=\"\",\"\",SUMIF(Ausgaben!B:B,B307,Ausgaben!A:A))","v":""},{"$f":"IF(B307=\"\",\"\",SUMIF(Einnahmen!B:B,B307,Einnahmen!A:A))","v":""}]
[null,{"$f":"IF(Konfiguration!B298=\"\",\"\",Konfiguration!B298)","v":""},null,null,null,{"$f":"IF(Konfiguration!B298=\"\",\"\",Konfiguration!C298)","v":""},{"$f":"IF(Konfiguration!B298=\"\",\"\",Konfiguration!D298)","v":""},null,null,null,{"$f":"IF(B308=\"\",\"\",SUMIF(Ausgaben!B:B,B308,Ausgaben!A:A))","v":""},{"$f":"IF(B308=\"\",\"\",SUMIF(Einnahmen!B:B,B308,Einnahmen!A:A))","v":""}]
[null,{"$f":"IF(Konfiguration!B299=\"\",\"\",Konfiguration!B299)","v":""},null,null,null,{"$f":"IF(Konfiguration!B299=\"\",\"\",Konfiguration!C299)","v":""},{"$f":"IF(Konfiguration!B299=\"\",\"\",Konfiguration!D299)","v":""},null,null,null,{"$f":"IF(B309=\"\",\"\",SUMIF(Ausgaben!B:B,B309,Ausgaben!A:A))","v":""},{"$f":"IF(B309=\"\",\"\",SUMIF(Einnahmen!B:B,B309,Einnahmen!A:A))","v":""}]
[null,{"$f":"IF(Konfiguration!B300=\"\",\"\",Konfiguration!B300)","v":""},null,null,null,{"$f":"IF(Konfiguration!B300=\"\",\"\",Konfiguration!C300)","v":""},{"$f":"IF(Konfiguration!B300=\"\",\"\",Konfiguration!D300)","v":""},null,null,null,{"$f":"IF(B310=\"\",\"\",SUMIF(Ausgaben!B:B,B310,Ausgaben!A:A))","v":""},{"$f":"IF(B310=\"\",\"\",SUMIF(Einnahmen!B:B,B310,Einnahmen!A:A))","v":""}]
[null,{"$f":"IF(Konfiguration!B301=\"\",\"\",Konfiguration!B301)","v":""},null,null,null,{"$f":"IF(Konfiguration!B301=\"\",\"\",Konfiguration!C301)","v":""},{"$f":"IF(Konfiguration!B301=\"\",\"\",Konfiguration!D301)","v":""},null,null,null,{"$f":"IF(B311=\"\",\"\",SUMIF(Ausgaben!B:B,B311,Ausgaben!A:A))","v":""},{"$f":"IF(B311=\"\",\"\",SUMIF(Einnahmen!B:B,B311,Einnahmen!A:A))","v":""}]
[null,{"$f":"IF(Konfiguration!B302=\"\",\"\",Konfiguration!B302)","v":""},null,null,null,{"$f":"IF(Konfiguration!B302=\"\",\"\",Konfiguration!C302)","v":""},{"$f":"IF(Konfiguration!B302=\"\",\"\",Konfiguration!D302)","v":""},null,null,null,{"$f":"IF(B312=\"\",\"\",SUMIF(Ausgaben!B:B,B312,Ausgaben!A:A))","v":""},{"$f":"IF(B312=\"\",\"\",SUMIF(Einnahmen!B:B,B312,Einnahmen!A:A))","v":""}]
[null,{"$f":"IF(Konfiguration!B303=\"\",\"\",Konfiguration!B303)","v":""},null,null,null,{"$f":"IF(Konfiguration!B303=\"\",\"\",Konfiguration!C303)","v":""},{"$f":"IF(Konfiguration!B303=\"\",\"\",Konfiguration!D303)","v":""},null,null,null,{"$f":"IF(B313=\"\",\"\",SUMIF(Ausgaben!B:B,B313,Ausgaben!A:A))","v":""},{"$f":"IF(B313=\"\",\"\",SUMIF(Einnahmen!B:B,B313,Einnahmen!A:A))","v":""}]
[null,{"$f":"IF(Konfiguration!B304=\"\",\"\",Konfiguration!B304)","v":""},null,null,null,{"$f":"IF(Konfiguration!B304=\"\",\"\",Konfiguration!C304)","v":""},{"$f":"IF(Konfiguration!B304=\"\",\"\",Konfiguration!D304)","v":""},null,null,null,{"$f":"IF(B314=\"\",\"\",SUMIF(Ausgaben!B:B,B314,Ausgaben!A:A))","v":""},{"$f":"IF(B314=\"\",\"\",SUMIF(Einnahmen!B:B,B314,Einnahmen!A:A))","v":""}]
[null,{"$f":"IF(Konfiguration!B305=\"\",\"\",Konfiguration!B305)","v":""},null,null,null,{"$f":"IF(Konfiguration!B305=\"\",\"\",Konfiguration!C305)","v":""},{"$f":"IF(Konfiguration!B305=\"\",\"\",Konfiguration!D305)","v":""},null,null,null,{"$f":"IF(B315=\"\",\"\",SUMIF(Ausgaben!B:B,B315,Ausgaben!A:A))","v":""},{"$f":"IF(B315=\"\",\"\",SUMIF(Einnahmen!B:B,B315,Einnahmen!A:A))","v":""}]
[null,{"$f":"IF(Konfiguration!B306=\"\",\"\",Konfiguration!B306)","v":""},null,null,null,{"$f":"IF(Konfiguration!B306=\"\",\"\",Konfiguration!C306)","v":""},{"$f":"IF(Konfiguration!B306=\"\",\"\",Konfiguration!D306)","v":""},null,null,null,{"$f":"IF(B316=\"\",\"\",SUMIF(Ausgaben!B:B,B316,Ausgaben!A:A))","v":""},{"$f":"IF(B316=\"\",\"\",SUMIF(Einnahmen!B:B,B316,Einnahmen!A:A))","v":""}]
[null,{"$f":"IF(Konfiguration!B307=\"\",\"\",Konfiguration!B307)","v":""},null,null,null,{"$f":"IF(Konfiguration!B307=\"\",\"\",Konfiguration!C307)","v":""},{"$f":"IF(Konfiguration!B307=\"\",\"\",Konfiguration!D307)","v":""},null,null,null,{"$f":"IF(B317=\"\",\"\",SUMIF(Ausgaben!B:B,B317,Ausgaben!A:A))","v":""},{"$f":"IF(B317=\"\",\"\",SUMIF(Einnahmen!B:B,B317,Einnahmen!A:A))","v":""}]
[null,{"$f":"IF(Konfiguration!B308=\"\",\"\",Konfiguration!B308)","v":""},null,null,null,{"$f":"IF(Konfiguration!B308=\"\",\"\",Konfiguration!C308)","v":""},{"$f":"IF(Konfiguration!B308=\"\",\"\",Konfiguration!D308)","v":""},null,null,null,{"$f":"IF(B318=\"\",\"\",SUMIF(Ausgaben!B:B,B318,Ausgaben!A:A))","v":""},{"$f":"IF(B318=\"\",\"\",SUMIF(Einnahmen!B:B,B318,Einnahmen!A:A))","v":""}]
[null,{"$f":"IF(Konfiguration!B309=\"\",\"\",Konfiguration!B309)","v":""},null,null,null,{"$f":"IF(Konfiguration!B309=\"\",\"\",Konfiguration!C309)","v":""},{"$f":"IF(Konfiguration!B309=\"\",\"\",Konfiguration!D309)","v":""},null,null,null,{"$f":"IF(B319=\"\",\"\",SUMIF(Ausgaben!B:B,B319,Ausgaben!A:A))","v":""},{"$f":"IF(B319=\"\",\"\",SUMIF(Einnahmen!B:B,B319,Einnahmen!A:A))","v":""}]
[null,{"$f":"IF(Konfiguration!B310=\"\",\"\",Konfiguration!B310)","v":""},null,null,null,{"$f":"IF(Konfiguration!B310=\"\",\"\",Konfiguration!C310)","v":""},{"$f":"IF(Konfiguration!B310=\"\",\"\",Konfiguration!D310)","v":""},null,null,null,{"$f":"IF(B320=\"\",\"\",SUMIF(Ausgaben!B:B,B320,Ausgaben!A:A))","v":""},{"$f":"IF(B320=\"\",\"\",SUMIF(Einnahmen!B:B,B320,Einnahmen!A:A))","v":""}]
[null,{"$f":"IF(Konfiguration!B311=\"\",\"\",Konfiguration!B311)","v":""},null,null,null,{"$f":"IF(Konfiguration!B311=\"\",\"\",Konfiguration!C311)","v":""},{"$f":"IF(Konfiguration!B311=\"\",\"\",Konfiguration!D311)","v":""},null,null,null,{"$f":"IF(B321=\"\",\"\",SUMIF(Ausgaben!B:B,B321,Ausgaben!A:A))","v":""},{"$f":"IF(B321=\"\",\"\",SUMIF(Einnahmen!B:B,B321,Einnahmen!A:A))","v":""}]
[null,{"$f":"IF(Konfiguration!B312=\"\",\"\",Konfiguration!B312)","v":""},null,null,null,{"$f":"IF(Konfiguration!B312=\"\",\"\",Konfiguration!C312)","v":""},{"$f":"IF(Konfiguration!B312=\"\",\"\",Konfiguration!D312)","v":""},null,null,null,{"$f":"IF(B322=\"\",\"\",SUMIF(Ausgaben!B:B,B322,Ausgaben!A:A))","v":""},{"$f":"IF(B322=\"\",\"\",SUMIF(Einnahmen!B:B,B322,Einnahmen!A:A))","v":""}]
[null,{"$f":"IF(Konfiguration!B313=\"\",\"\",Konfiguration!B313)","v":""},null,null,null,{"$f":"IF(Konfiguration!B313=\"\",\"\",Konfiguration!C313)","v":""},{"$f":"IF(Konfiguration!B313=\"\",\"\",Konfiguration!D313)","v":""},null,null,null,{"$f":"IF(B323=\"\",\"\",SUMIF(Ausgaben!B:B,B323,Ausgaben!A:A))","v":""},{"$f":"IF(B323=\"\",\"\",SUMIF(Einnahmen!B:B,B323,Einnahmen!A:A))","v":""}]
[null,{"$f":"IF(Konfiguration!B314=\"\",\"\",Konfiguration!B314)","v":""},null,null,null,{"$f":"IF(Konfiguration!B314=\"\",\"\",Konfiguration!C314)","v":""},{"$f":"IF(Konfiguration!B314=\"\",\"\",Konfiguration!D314)","v":""},null,null,null,{"$f":"IF(B324=\"\",\"\",SUMIF(Ausgaben!B:B,B324,Ausgaben!A:A))","v":""},{"$f":"IF(B324=\"\",\"\",SUMIF(Einnahmen!B:B,B324,Einnahmen!A:A))","v":""}]
[null,{"$f":"IF(Konfiguration!B315=\"\",\"\",Konfiguration!B315)","v":""},null,null,null,{"$f":"IF(Konfiguration!B315=\"\",\"\",Konfiguration!C315)","v":""},{"$f":"IF(Konfiguration!B315=\"\",\"\",Konfiguration!D315)","v":""},null,null,null,{"$f":"IF(B325=\"\",\"\",SUMIF(Ausgaben!B:B,B325,Ausgaben!A:A))","v":""},{"$f":"IF(B325=\"\",\"\",SUMIF(Einnahmen!B:B,B325,Einnahmen!A:A))","v":""}]
[null,{"$f":"IF(Konfiguration!B316=\"\",\"\",Konfiguration!B316)","v":""},null,null,null,{"$f":"IF(Konfiguration!B316=\"\",\"\",Konfiguration!C316)","v":""},{"$f":"IF(Konfiguration!B316=\"\",\"\",Konfiguration!D316)","v":""},null,null,null,{"$f":"IF(B326=\"\",\"\",SUMIF(Ausgaben!B:B,B326,Ausgaben!A:A))","v":""},{"$f":"IF(B326=\"\",\"\",SUMIF(Einnahmen!B:B,B326,Einnahmen!A:A))","v":""}]
[null,{"$f":"IF(Konfiguration!B317=\"\",\"\",Konfiguration!B317)","v":""},null,null,null,{"$f":"IF(Konfiguration!B317=\"\",\"\",Konfiguration!C317)","v":""},{"$f":"IF(Konfiguration!B317=\"\",\"\",Konfiguration!D317)","v":""},null,null,null,{"$f":"IF(B327=\"\",\"\",SUMIF(Ausgaben!B:B,B327,Ausgaben!A:A))","v":""},{"$f":"IF(B327=\"\",\"\",SUMIF(Einnahmen!B:B,B327,Einnahmen!A:A))","v":""}]
[null,{"$f":"IF(Konfiguration!B318=\"\",\"\",Konfiguration!B318)","v":""},null,null,null,{"$f":"IF(Konfiguration!B318=\"\",\"\",Konfiguration!C318)","v":""},{"$f":"IF(Konfiguration!B318=\"\",\"\",Konfiguration!D318)","v":""},null,null,null,{"$f":"IF(B328=\"\",\"\",SUMIF(Ausgaben!B:B,B328,Ausgaben!A:A))","v":""},{"$f":"IF(B328=\"\",\"\",SUMIF(Einnahmen!B:B,B328,Einnahmen!A:A))","v":""}]
[null,{"$f":"IF(Konfiguration!B319=\"\",\"\",Konfiguration!B319)","v":""},null,null,null,{"$f":"IF(Konfiguration!B319=\"\",\"\",Konfiguration!C319)","v":""},{"$f":"IF(Konfiguration!B319=\"\",\"\",Konfiguration!D319)","v":""},null,null,null,{"$f":"IF(B329=\"\",\"\",SUMIF(Ausgaben!B:B,B329,Ausgaben!A:A))","v":""},{"$f":"IF(B329=\"\",\"\",SUMIF(Einnahmen!B:B,B329,Einnahmen!A:A))","v":""}]
[null,{"$f":"IF(Konfiguration!B320=\"\",\"\",Konfiguration!B320)","v":""},null,null,null,{"$f":"IF(Konfiguration!B320=\"\",\"\",Konfiguration!C320)","v":""},{"$f":"IF(Konfiguration!B320=\"\",\"\",Konfiguration!D320)","v":""},null,null,null,{"$f":"IF(B330=\"\",\"\",SUMIF(Ausgaben!B:B,B330,Ausgaben!A:A))","v":""},{"$f":"IF(B330=\"\",\"\",SUMIF(Einnahmen!B:B,B330,Einnahmen!A:A))","v":""}]
[null,{"$f":"IF(Konfiguration!B321=\"\",\"\",Konfiguration!B321)","v":""},null,null,null,{"$f":"IF(Konfiguration!B321=\"\",\"\",Konfiguration!C321)","v":""},{"$f":"IF(Konfiguration!B321=\"\",\"\",Konfiguration!D321)","v":""},null,null,null,{"$f":"IF(B331=\"\",\"\",SUMIF(Ausgaben!B:B,B331,Ausgaben!A:A))","v":""},{"$f":"IF(B331=\"\",\"\",SUMIF(Einnahmen!B:B,B331,Einnahmen!A:A))","v":""}]
[null,{"$f":"IF(Konfiguration!B322=\"\",\"\",Konfiguration!B322)","v":""},null,null,null,{"$f":"IF(Konfiguration!B322=\"\",\"\",Konfiguration!C322)","v":""},{"$f":"IF(Konfiguration!B322=\"\",\"\",Konfiguration!D322)","v":""},null,null,null,{"$f":"IF(B332=\"\",\"\",SUMIF(Ausgaben!B:B,B332,Ausgaben!A:A))","v":""},{"$f":"IF(B332=\"\",\"\",SUMIF(Einnahmen!B:B,B332,Einnahmen!A:A))","v":""}]
[null,{"$f":"IF(Konfiguration!B323=\"\",\"\",Konfiguration!B323)","v":""},null,null,null,{"$f":"IF(Konfiguration!B323=\"\",\"\",Konfiguration!C323)","v":""},{"$f":"IF(Konfiguration!B323=\"\",\"\",Konfiguration!D323)","v":""},null,null,null,{"$f":"IF(B333=\"\",\"\",SUMIF(Ausgaben!B:B,B333,Ausgaben!A:A))","v":""},{"$f":"IF(B333=\"\",\"\",SUMIF(Einnahmen!B:B,B333,Einnahmen!A:A))","v":""}]
[null,{"$f":"IF(Konfiguration!B324=\"\",\"\",Konfiguration!B324)","v":""},null,null,null,{"$f":"IF(Konfiguration!B324=\"\",\"\",Konfiguration!C324)","v":""},{"$f":"IF(Konfiguration!B324=\"\",\"\",Konfiguration!D324)","v":""},null,null,null,{"$f":"IF(B334=\"\",\"\",SUMIF(Ausgaben!B:B,B334,Ausgaben!A:A))","v":""},{"$f":"IF(B334=\"\",\"\",SUMIF(Einnahmen!B:B,B334,Einnahmen!A:A))","v":""}]
[null,{"$f":"IF(Konfiguration!B325=\"\",\"\",Konfiguration!B325)","v":""},null,null,null,{"$f":"IF(Konfiguration!B325=\"\",\"\",Konfiguration!C325)","v":""},{"$f":"IF(Konfiguration!B325=\"\",\"\",Konfiguration!D325)","v":""},null,null,null,{"$f":"IF(B335=\"\",\"\",SUMIF(Ausgaben!B:B,B335,Ausgaben!A:A))","v":""},{"$f":"IF(B335=\"\",\"\",SUMIF(Einnahmen!B:B,B335,Einnahmen!A:A))","v":""}]
[null,{"$f":"IF(Konfiguration!B326=\"\",\"\",Konfiguration!B326)","v":""},null,null,null,{"$f":"IF(Konfiguration!B326=\"\",\"\",Konfiguration!C326)","v":""},{"$f":"IF(Konfiguration!B326=\"\",\"\",Konfiguration!D326)","v":""},null,null,null,{"$f":"IF(B336=\"\",\"\",SUMIF(Ausgaben!B:B,B336,Ausgaben!A:A))","v":""},{"$f":"IF(B336=\"\",\"\",SUMIF(Einnahmen!B:B,B336,Einnahmen!A:A))","v":""}]
[null,{"$f":"IF(Konfiguration!B327=\"\",\"\",Konfiguration!B327)","v":""},null,null,null,{"$f":"IF(Konfiguration!B327=\"\",\"\",Konfiguration!C327)","v":""},{"$f":"IF(Konfiguration!B327=\"\",\"\",Konfiguration!D327)","v":""},null,null,null,{"$f":"IF(B337=\"\",\"\",SUMIF(Ausgaben!B:B,B337,Ausgaben!A:A))","v":""},{"$f":"IF(B337=\"\",\"\",SUMIF(Einnahmen!B:B,B337,Einnahmen!A:A))","v":""}]
[null,{"$f":"IF(Konfiguration!B328=\"\",\"\",Konfiguration!B328)","v":""},null,null,null,{"$f":"IF(Konfiguration!B328=\"\",\"\",Konfiguration!C328)","v":""},{"$f":"IF(Konfiguration!B328=\"\",\"\",Konfiguration!D328)","v":""},null,null,null,{"$f":"IF(B338=\"\",\"\",SUMIF(Ausgaben!B:B,B338,Ausgaben!A:A))","v":""},{"$f":"IF(B338=\"\",\"\",SUMIF(Einnahmen!B:B,B338,Einnahmen!A:A))","v":""}]
[null,{"$f":"IF(Konfiguration!B329=\"\",\"\",Konfiguration!B329)","v":""},null,null,null,{"$f":"IF(Konfiguration!B329=\"\",\"\",Konfiguration!C329)","v":""},{"$f":"IF(Konfiguration!B329=\"\",\"\",Konfiguration!D329)","v":""},null,null,null,{"$f":"IF(B339=\"\",\"\",SUMIF(Ausgaben!B:B,B339,Ausgaben!A:A))","v":""},{"$f":"IF(B339=\"\",\"\",SUMIF(Einnahmen!B:B,B339,Einnahmen!A:A))","v":""}]
[null,{"$f":"IF(Konfiguration!B330=\"\",\"\",Konfiguration!B330)","v":""},null,null,null,{"$f":"IF(Konfiguration!B330=\"\",\"\",Konfiguration!C330)","v":""},{"$f":"IF(Konfiguration!B330=\"\",\"\",Konfiguration!D330)","v":""},null,null,null,{"$f":"IF(B340=\"\",\"\",SUMIF(Ausgaben!B:B,B340,Ausgaben!A:A))","v":""},{"$f":"IF(B340=\"\",\"\",SUMIF(Einnahmen!B:B,B340,Einnahmen!A:A))","v":""}]
[null,{"$f":"IF(Konfiguration!B331=\"\",\"\",Konfiguration!B331)","v":""},null,null,null,{"$f":"IF(Konfiguration!B331=\"\",\"\",Konfiguration!C331)","v":""},{"$f":"IF(Konfiguration!B331=\"\",\"\",Konfiguration!D331)","v":""},null,null,null,{"$f":"IF(B341=\"\",\"\",SUMIF(Ausgaben!B:B,B341,Ausgaben!A:A))","v":""},{"$f":"IF(B341=\"\",\"\",SUMIF(Einnahmen!B:B,B341,Einnahmen!A:A))","v":""}]
[null,{"$f":"IF(Konfiguration!B332=\"\",\"\",Konfiguration!B332)","v":""},null,null,null,{"$f":"IF(Konfiguration!B332=\"\",\"\",Konfiguration!C332)","v":""},{"$f":"IF(Konfiguration!B332=\"\",\"\",Konfiguration!D332)","v":""},null,null,null,{"$f":"IF(B342=\"\",\"\",SUMIF(Ausgaben!B:B,B342,Ausgaben!A:A))","v":""},{"$f":"IF(B342=\"\",\"\",SUMIF(Einnahmen!B:B,B342,Einnahmen!A:A))","v":""}]
[null,{"$f":"IF(Konfiguration!B333=\"\",\"\",Konfiguration!B333)","v":""},null,null,null,{"$f":"IF(Konfiguration!B333=\"\",\"\",Konfiguration!C333)","v":""},{"$f":"IF(Konfiguration!B333=\"\",\"\",Konfiguration!D333)","v":""},null,null,null,{"$f":"IF(B343=\"\",\"\",SUMIF(Ausgaben!B:B,B343,Ausgaben!A:A))","v":""},{"$f":"IF(B343=\"\",\"\",SUMIF(Einnahmen!B:B,B343,Einnahmen!A:A))","v":""}]
[null,{"$f":"IF(Konfiguration!B334=\"\",\"\",Konfiguration!B334)","v":""},null,null,null,{"$f":"IF(Konfiguration!B334=\"\",\"\",Konfiguration!C334)","v":""},{"$f":"IF(Konfiguration!B334=\"\",\"\",Konfiguration!D334)","v":""},null,null,null,{"$f":"IF(B344=\"\",\"\",SUMIF(Ausgaben!B:B,B344,Ausgaben!A:A))","v":""},{"$f":"IF(B344=\"\",\"\",SUMIF(Einnahmen!B:B,B344,Einnahmen!A:A))","v":""}]
[null,{"$f":"IF(Konfiguration!B335=\"\",\"\",Konfiguration!B335)","v":""},null,null,null,{"$f":"IF(Konfiguration!B335=\"\",\"\",Konfiguration!C335)","v":""},{"$f":"IF(Konfiguration!B335=\"\",\"\",Konfiguration!D335)","v":""},null,null,null,{"$f":"IF(B345=\"\",\"\",SUMIF(Ausgaben!B:B,B345,Ausgaben!A:A))","v":""},{"$f":"IF(B345=\"\",\"\",SUMIF(Einnahmen!B:B,B345,Einnahmen!A:A))","v":""}]
[null,{"$f":"IF(Konfiguration!B336=\"\",\"\",Konfiguration!B336)","v":""},null,null,null,{"$f":"IF(Konfiguration!B336=\"\",\"\",Konfiguration!C336)","v":""},{"$f":"IF(Konfiguration!B336=\"\",\"\",Konfiguration!D336)","v":""},null,null,null,{"$f":"IF(B346=\"\",\"\",SUMIF(Ausgaben!B:B,B346,Ausgaben!A:A))","v":""},{"$f":"IF(B346=\"\",\"\",SUMIF(Einnahmen!B:B,B346,Einnahmen!A:A))","v":""}]
[null,{"$f":"IF(Konfiguration!B337=\"\",\"\",Konfiguration!B337)","v":""},null,null,null,{"$f":"IF(Konfiguration!B337=\"\",\"\",Konfiguration!C337)","v":""},{"$f":"IF(Konfiguration!B337=\"\",\"\",Konfiguration!D337)","v":""},null,null,null,{"$f":"IF(B347=\"\",\"\",SUMIF(Ausgaben!B:B,B347,Ausgaben!A:A))","v":""},{"$f":"IF(B347=\"\",\"\",SUMIF(Einnahmen!B:B,B347,Einnahmen!A:A))","v":""}]
[null,{"$f":"IF(Konfiguration!B338=\"\",\"\",Konfiguration!B338)","v":""},null,null,null,{"$f":"IF(Konfiguration!B338=\"\",\"\",Konfiguration!C338)","v":""},{"$f":"IF(Konfiguration!B338=\"\",\"\",Konfiguration!D338)","v":""},null,null,null,{"$f":"IF(B348=\"\",\"\",SUMIF(Ausgaben!B:B,B348,Ausgaben!A:A))","v":""},{"$f":"IF(B348=\"\",\"\",SUMIF(Einnahmen!B:B,B348,Einnahmen!A:A))","v":""}]
[null,{"$f":"IF(Konfiguration!B339=\"\",\"\",Konfiguration!B339)","v":""},null,null,null,{"$f":"IF(Konfiguration!B339=\"\",\"\",Konfiguration!C339)","v":""},{"$f":"IF(Konfiguration!B339=\"\",\"\",Konfiguration!D339)","v":""},null,null,null,{"$f":"IF(B349=\"\",\"\",SUMIF(Ausgaben!B:B,B349,Ausgaben!A:A))","v":""},{"$f":"IF(B349=\"\",\"\",SUMIF(Einnahmen!B:B,B349,Einnahmen!A:A))","v":""}]
[null,{"$f":"IF(Konfiguration!B340=\"\",\"\",Konfiguration!B340)","v":""},null,null,null,{"$f":"IF(Konfiguration!B340=\"\",\"\",Konfiguration!C340)","v":""},{"$f":"IF(Konfiguration!B340=\"\",\"\",Konfiguration!D340)","v":""},null,null,null,{"$f":"IF(B350=\"\",\"\",SUMIF(Ausgaben!B:B,B350,Ausgaben!A:A))","v":""},{"$f":"IF(B350=\"\",\"\",SUMIF(Einnahmen!B:B,B350,Einnahmen!A:A))","v":""}]
[null,{"$f":"IF(Konfiguration!B341=\"\",\"\",Konfiguration!B341)","v":""},null,null,null,{"$f":"IF(Konfiguration!B341=\"\",\"\",Konfiguration!C341)","v":""},{"$f":"IF(Konfiguration!B341=\"\",\"\",Konfiguration!D341)","v":""},null,null,null,{"$f":"IF(B351=\"\",\"\",SUMIF(Ausgaben!B:B,B351,Ausgaben!A:A))","v":""},{"$f":"IF(B351=\"\",\"\",SUMIF(Einnahmen!B:B,B351,Einnahmen!A:A))","v":""}]
[null,{"$f":"IF(Konfiguration!B342=\"\",\"\",Konfiguration!B342)","v":""},null,null,null,{"$f":"IF(Konfiguration!B342=\"\",\"\",Konfiguration!C342)","v":""},{"$f":"IF(Konfiguration!B342=\"\",\"\",Konfiguration!D342)","v":""},null,null,null,{"$f":"IF(B352=\"\",\"\",SUMIF(Ausgaben!B:B,B352,Ausgaben!A:A))","v":""},{"$f":"IF(B352=\"\",\"\",SUMIF(Einnahmen!B:B,B352,Einnahmen!A:A))","v":""}]
[null,{"$f":"IF(Konfiguration!B343=\"\",\"\",Konfiguration!B343)","v":""},null,null,null,{"$f":"IF(Konfiguration!B343=\"\",\"\",Konfiguration!C343)","v":""},{"$f":"IF(Konfiguration!B343=\"\",\"\",Konfiguration!D343)","v":""},null,null,null,{"$f":"IF(B353=\"\",\"\",SUMIF(Ausgaben!B:B,B353,Ausgaben!A:A))","v":""},{"$f":"IF(B353=\"\",\"\",SUMIF(Einnahmen!B:B,B353,Einnahmen!A:A))","v":""}]
[null,{"$f":"IF(Konfiguration!B344=\"\",\"\",Konfiguration!B344)","v":""},null,null,null,{"$f":"IF(Konfiguration!B344=\"\",\"\",Konfiguration!C344)","v":""},{"$f":"IF(Konfiguration!B344=\"\",\"\",Konfiguration!D344)","v":""},null,null,null,{"$f":"IF(B354=\"\",\"\",SUMIF(Ausgaben!B:B,B354,Ausgaben!A:A))","v":""},{"$f":"IF(B354=\"\",\"\",SUMIF(Einnahmen!B:B,B354,Einnahmen!A:A))","v":""}]
[null,{"$f":"IF(Konfiguration!B345=\"\",\"\",Konfiguration!B345)","v":""},null,null,null,{"$f":"IF(Konfiguration!B345=\"\",\"\",Konfiguration!C345)","v":""},{"$f":"IF(Konfiguration!B345=\"\",\"\",Konfiguration!D345)","v":""},null,null,null,{"$f":"IF(B355=\"\",\"\",SUMIF(Ausgaben!B:B,B355,Ausgaben!A:A))","v":""},{"$f":"IF(B355=\"\",\"\",SUMIF(Einnahmen!B:B,B355,Einnahmen!A:A))","v":""}]
[null,{"$f":"IF(Konfiguration!B346=\"\",\"\",Konfiguration!B346)","v":""},null,null,null,{"$f":"IF(Konfiguration!B346=\"\",\"\",Konfiguration!C346)","v":""},{"$f":"IF(Konfiguration!B346=\"\",\"\",Konfiguration!D346)","v":""},null,null,null,{"$f":"IF(B356=\"\",\"\",SUMIF(Ausgaben!B:B,B356,Ausgaben!A:A))","v":""},{"$f":"IF(B356=\"\",\"\",SUMIF(Einnahmen!B:B,B356,Einnahmen!A:A))","v":""}]
[null,{"$f":"IF(Konfiguration!B347=\"\",\"\",Konfiguration!B347)","v":""},null,null,null,{"$f":"IF(Konfiguration!B347=\"\",\"\",Konfiguration!C347)","v":""},{"$f":"IF(Konfiguration!B347=\"\",\"\",Konfiguration!D347)","v":""},null,null,null,{"$f":"IF(B357=\"\",\"\",SUMIF(Ausgaben!B:B,B357,Ausgaben!A:A))","v":""},{"$f":"IF(B357=\"\",\"\",SUMIF(Einnahmen!B:B,B357,Einnahmen!A:A))","v":""}]
[null,{"$f":"IF(Konfiguration!B348=\"\",\"\",Konfiguration!B348)","v":""},null,null,null,{"$f":"IF(Konfiguration!B348=\"\",\"\",Konfiguration!C348)","v":""},{"$f":"IF(Konfiguration!B348=\"\",\"\",Konfiguration!D348)","v":""},null,null,null,{"$f":"IF(B358=\"\",\"\",SUMIF(Ausgaben!B:B,B358,Ausgaben!A:A))","v":""},{"$f":"IF(B358=\"\",\"\",SUMIF(Einnahmen!B:B,B358,Einnahmen!A:A))","v":""}]
[null,{"$f":"IF(Konfiguration!B349=\"\",\"\",Konfiguration!B349)","v":""},null,null,null,{"$f":"IF(Konfiguration!B349=\"\",\"\",Konfiguration!C349)","v":""},{"$f":"IF(Konfiguration!B349=\"\",\"\",Konfiguration!D349)","v":""},null,null,null,{"$f":"IF(B359=\"\",\"\",SUMIF(Ausgaben!B:B,B359,Ausgaben!A:A))","v":""},{"$f":"IF(B359=\"\",\"\",SUMIF(Einnahmen!B:B,B359,Einnahmen!A:A))","v":""}]
[null,{"$f":"IF(Konfiguration!B350=\"\",\"\",Konfiguration!B350)","v":""},null,null,null,{"$f":"IF(Konfiguration!B350=\"\",\"\",Konfiguration!C350)","v":""},{"$f":"IF(Konfiguration!B350=\"\",\"\",Konfiguration!D350)","v":""},null,null,null,{"$f":"IF(B360=\"\",\"\",SUMIF(Ausgaben!B:B,B360,Ausgaben!A:A))","v":""},{"$f":"IF(B360=\"\",\"\",SUMIF(Einnahmen!B:B,B360,Einnahmen!A:A))","v":""}]
[null,{"$f":"IF(Konfiguration!B351=\"\",\"\",Konfiguration!B351)","v":""},null,null,null,{"$f":"IF(Konfiguration!B351=\"\",\"\",Konfiguration!C351)","v":""},{"$f":"IF(Konfiguration!B351=\"\",\"\",Konfiguration!D351)","v":""},null,null,null,{"$f":"IF(B361=\"\",\"\",SUMIF(Ausgaben!B:B,B361,Ausgaben!A:A))","v":""},{"$f":"IF(B361=\"\",\"\",SUMIF(Einnahmen!B:B,B361,Einnahmen!A:A))","v":""}]
[null,{"$f":"IF(Konfiguration!B352=\"\",\"\",Konfiguration!B352)","v":""},null,null,null,{"$f":"IF(Konfiguration!B352=\"\",\"\",Konfiguration!C352)","v":""},{"$f":"IF(Konfiguration!B352=\"\",\"\",Konfiguration!D352)","v":""},null,null,null,{"$f":"IF(B362=\"\",\"\",SUMIF(Ausgaben!B:B,B362,Ausgaben!A:A))","v":""},{"$f":"IF(B362=\"\",\"\",SUMIF(Einnahmen!B:B,B362,Einnahmen!A:A))","v":""}]
[null,{"$f":"IF(Konfiguration!B353=\"\",\"\",Konfiguration!B353)","v":""},null,null,null,{"$f":"IF(Konfiguration!B353=\"\",\"\",Konfiguration!C353)","v":""},{"$f":"IF(Konfiguration!B353=\"\",\"\",Konfiguration!D353)","v":""},null,null,null,{"$f":"IF(B363=\"\",\"\",SUMIF(Ausgaben!B:B,B363,Ausgaben!A:A))","v":""},{"$f":"IF(B363=\"\",\"\",SUMIF(Einnahmen!B:B,B363,Einnahmen!A:A))","v":""}]
[null,{"$f":"IF(Konfiguration!B354=\"\",\"\",Konfiguration!B354)","v":""},null,null,null,{"$f":"IF(Konfiguration!B354=\"\",\"\",Konfiguration!C354)","v":""},{"$f":"IF(Konfiguration!B354=\"\",\"\",Konfiguration!D354)","v":""},null,null,null,{"$f":"IF(B364=\"\",\"\",SUMIF(Ausgaben!B:B,B364,Ausgaben!A:A))","v":""},{"$f":"IF(B364=\"\",\"\",SUMIF(Einnahmen!B:B,B364,Einnahmen!A:A))","v":""}]
[null,{"$f":"IF(Konfiguration!B355=\"\",\"\",Konfiguration!B355)","v":""},null,null,null,{"$f":"IF(Konfiguration!B355=\"\",\"\",Konfiguration!C355)","v":""},{"$f":"IF(Konfiguration!B355=\"\",\"\",Konfiguration!D355)","v":""},null,null,null,{"$f":"IF(B365=\"\",\"\",SUMIF(Ausgaben!B:B,B365,Ausgaben!A:A))","v":""},{"$f":"IF(B365=\"\",\"\",SUMIF(Einnahmen!B:B,B365,Einnahmen!A:A))","v":""}]
[null,{"$f":"IF(Konfiguration!B356=\"\",\"\",Konfiguration!B356)","v":""},null,null,null,{"$f":"IF(Konfiguration!B356=\"\",\"\",Konfiguration!C356)","v":""},{"$f":"IF(Konfiguration!B356=\"\",\"\",Konfiguration!D356)","v":""},null,null,null,{"$f":"IF(B366=\"\",\"\",SUMIF(Ausgaben!B:B,B366,Ausgaben!A:A))","v":""},{"$f":"IF(B366=\"\",\"\",SUMIF(Einnahmen!B:B,B366,Einnahmen!A:A))","v":""}]
[null,{"$f":"IF(Konfiguration!B357=\"\",\"\",Konfiguration!B357)","v":""},null,null,null,{"$f":"IF(Konfiguration!B357=\"\",\"\",Konfiguration!C357)","v":""},{"$f":"IF(Konfiguration!B357=\"\",\"\",Konfiguration!D357)","v":""},null,null,null,{"$f":"IF(B367=\"\",\"\",SUMIF(Ausgaben!B:B,B367,Ausgaben!A:A))","v":""},{"$f":"IF(B367=\"\",\"\",SUMIF(Einnahmen!B:B,B367,Einnahmen!A:A))","v":""}]
[null,{"$f":"IF(Konfiguration!B358=\"\",\"\",Konfiguration!B358)","v":""},null,null,null,{"$f":"IF(Konfiguration!B358=\"\",\"\",Konfiguration!C358)","v":""},{"$f":"IF(Konfiguration!B358=\"\",\"\",Konfiguration!D358)","v":""},null,null,null,{"$f":"IF(B368=\"\",\"\",SUMIF(Ausgaben!B:B,B368,Ausgaben!A:A))","v":""},{"$f":"IF(B368=\"\",\"\",SUMIF(Einnahmen!B:B,B368,Einnahmen!A:A))","v":""}]
[null,{"$f":"IF(Konfiguration!B359=\"\",\"\",Konfiguration!B359)","v":""},null,null,null,{"$f":"IF(Konfiguration!B359=\"\",\"\",Konfiguration!C359)","v":""},{"$f":"IF(Konfiguration!B359=\"\",\"\",Konfiguration!D359)","v":""},null,null,null,{"$f":"IF(B369=\"\",\"\",SUMIF(Ausgaben!B:B,B369,Ausgaben!A:A))","v":""},{"$f":"IF(B369=\"\",\"\",SUMIF(Einnahmen!B:B,B369,Einnahmen!A:A))","v":""}]
[null,{"$f":"IF(Konfiguration!B360=\"\",\"\",Konfiguration!B360)","v":""},null,null,null,{"$f":"IF(Konfiguration!B360=\"\",\"\",Konfiguration!C360)","v":""},{"$f":"IF(Konfiguration!B360=\"\",\"\",Konfiguration!D360)","v":""},null,null,null,{"$f":"IF(B370=\"\",\"\",SUMIF(Ausgaben!B:B,B370,Ausgaben!A:A))","v":""},{"$f":"IF(B370=\"\",\"\",SUMIF(Einnahmen!B:B,B370,Einnahmen!A:A))","v":""}]
[null,{"$f":"IF(Konfiguration!B361=\"\",\"\",Konfiguration!B361)","v":""},null,null,null,{"$f":"IF(Konfiguration!B361=\"\",\"\",Konfiguration!C361)","v":""},{"$f":"IF(Konfiguration!B361=\"\",\"\",Konfiguration!D361)","v":""},null,null,null,{"$f":"IF(B371=\"\",\"\",SUMIF(Ausgaben!B:B,B371,Ausgaben!A:A))","v":""},{"$f":"IF(B371=\"\",\"\",SUMIF(Einnahmen!B:B,B371,Einnahmen!A:A))","v":""}]
[null,{"$f":"IF(Konfiguration!B362=\"\",\"\",Konfiguration!B362)","v":""},null,null,null,{"$f":"IF(Konfiguration!B362=\"\",\"\",Konfiguration!C362)","v":""},{"$f":"IF(Konfiguration!B362=\"\",\"\",Konfiguration!D362)","v":""},null,null,null,{"$f":"IF(B372=\"\",\"\",SUMIF(Ausgaben!B:B,B372,Ausgaben!A:A))","v":""},{"$f":"IF(B372=\"\",\"\",SUMIF(Einnahmen!B:B,B372,Einnahmen!A:A))","v":""}]
[null,{"$f":"IF(Konfiguration!B363=\"\",\"\",Konfiguration!B363)","v":""},null,null,null,{"$f":"IF(Konfiguration!B363=\"\",\"\",Konfiguration!C363)","v":""},{"$f":"IF(Konfiguration!B363=\"\",\"\",Konfiguration!D363)","v":""},null,null,null,{"$f":"IF(B373=\"\",\"\",SUMIF(Ausgaben!B:B,B373,Ausgaben!A:A))","v":""},{"$f":"IF(B373=\"\",\"\",SUMIF(Einnahmen!B:B,B373,Einnahmen!A:A))","v":""}]
[null,{"$f":"IF(Konfiguration!B364=\"\",\"\",Konfiguration!B364)","v":""},null,null,null,{"$f":"IF(Konfiguration!B364=\"\",\"\",Konfiguration!C364)","v":""},{"$f":"IF(Konfiguration!B364=\"\",\"\",Konfiguration!D364)","v":""},null,null,null,{"$f":"IF(B374=\"\",\"\",SUMIF(Ausgaben!B:B,B374,Ausgaben!A:A))","v":""},{"$f":"IF(B374=\"\",\"\",SUMIF(Einnahmen!B:B,B374,Einnahmen!A:A))","v":""}]
[null,{"$f":"IF(Konfiguration!B365=\"\",\"\",Konfiguration!B365)","v":""},null,null,null,{"$f":"IF(Konfiguration!B365=\"\",\"\",Konfiguration!C365)","v":""},{"$f":"IF(Konfiguration!B365=\"\",\"\",Konfiguration!D365)","v":""},null,null,null,{"$f":"IF(B375=\"\",\"\",SUMIF(Ausgaben!B:B,B375,Ausgaben!A:A))","v":""},{"$f":"IF(B375=\"\",\"\",SUMIF(Einnahmen!B:B,B375,Einnahmen!A:A))","v":""}]
[null,{"$f":"IF(Konfiguration!B366=\"\",\"\",Konfiguration!B366)","v":""},null,null,null,{"$f":"IF(Konfiguration!B366=\"\",\"\",Konfiguration!C366)","v":""},{"$f":"IF(Konfiguration!B366=\"\",\"\",Konfiguration!D366)","v":""},null,null,null,{"$f":"IF(B376=\"\",\"\",SUMIF(Ausgaben!B:B,B376,Ausgaben!A:A))","v":""},{"$f":"IF(B376=\"\",\"\",SUMIF(Einnahmen!B:B,B376,Einnahmen!A:A))","v":""}]
[null,{"$f":"IF(Konfiguration!B367=\"\",\"\",Konfiguration!B367)","v":""},null,null,null,{"$f":"IF(Konfiguration!B367=\"\",\"\",Konfiguration!C367)","v":""},{"$f":"IF(Konfiguration!B367=\"\",\"\",Konfiguration!D367)","v":""},null,null,null,{"$f":"IF(B377=\"\",\"\",SUMIF(Ausgaben!B:B,B377,Ausgaben!A:A))","v":""},{"$f":"IF(B377=\"\",\"\",SUMIF(Einnahmen!B:B,B377,Einnahmen!A:A))","v":""}]
[null,{"$f":"IF(Konfiguration!B368=\"\",\"\",Konfiguration!B368)","v":""},null,null,null,{"$f":"IF(Konfiguration!B368=\"\",\"\",Konfiguration!C368)","v":""},{"$f":"IF(Konfiguration!B368=\"\",\"\",Konfiguration!D368)","v":""},null,null,null,{"$f":"IF(B378=\"\",\"\",SUMIF(Ausgaben!B:B,B378,Ausgaben!A:A))","v":""},{"$f":"IF(B378=\"\",\"\",SUMIF(Einnahmen!B:B,B378,Einnahmen!A:A))","v":""}]
[null,{"$f":"IF(Konfiguration!B369=\"\",\"\",Konfiguration!B369)","v":""},null,null,null,{"$f":"IF(Konfiguration!B369=\"\",\"\",Konfiguration!C369)","v":""},{"$f":"IF(Konfiguration!B369=\"\",\"\",Konfiguration!D369)","v":""},null,null,null,{"$f":"IF(B379=\"\",\"\",SUMIF(Ausgaben!B:B,B379,Ausgaben!A:A))","v":""},{"$f":"IF(B379=\"\",\"\",SUMIF(Einnahmen!B:B,B379,Einnahmen!A:A))","v":""}]
[null,{"$f":"IF(Konfiguration!B370=\"\",\"\",Konfiguration!B370)","v":""},null,null,null,{"$f":"IF(Konfiguration!B370=\"\",\"\",Konfiguration!C370)","v":""},{"$f":"IF(Konfiguration!B370=\"\",\"\",Konfiguration!D370)","v":""},null,null,null,{"$f":"IF(B380=\"\",\"\",SUMIF(Ausgaben!B:B,B380,Ausgaben!A:A))","v":""},{"$f":"IF(B380=\"\",\"\",SUMIF(Einnahmen!B:B,B380,Einnahmen!A:A))","v":""}]
[null,{"$f":"IF(Konfiguration!B371=\"\",\"\",Konfiguration!B371)","v":""},null,null,null,{"$f":"IF(Konfiguration!B371=\"\",\"\",Konfiguration!C371)","v":""},{"$f":"IF(Konfiguration!B371=\"\",\"\",Konfiguration!D371)","v":""},null,null,null,{"$f":"IF(B381=\"\",\"\",SUMIF(Ausgaben!B:B,B381,Ausgaben!A:A))","v":""},{"$f":"IF(B381=\"\",\"\",SUMIF(Einnahmen!B:B,B381,Einnahmen!A:A))","v":""}]
[null,{"$f":"IF(Konfiguration!B372=\"\",\"\",Konfiguration!B372)","v":""},null,null,null,{"$f":"IF(Konfiguration!B372=\"\",\"\",Konfiguration!C372)","v":""},{"$f":"IF(Konfiguration!B372=\"\",\"\",Konfiguration!D372)","v":""},null,null,null,{"$f":"IF(B382=\"\",\"\",SUMIF(Ausgaben!B:B,B382,Ausgaben!A:A))","v":""},{"$f":"IF(B382=\"\",\"\",SUMIF(Einnahmen!B:B,B382,Einnahmen!A:A))","v":""}]
[null,{"$f":"IF(Konfiguration!B373=\"\",\"\",Konfiguration!B373)","v":""},null,null,null,{"$f":"IF(Konfiguration!B373=\"\",\"\",Konfiguration!C373)","v":""},{"$f":"IF(Konfiguration!B373=\"\",\"\",Konfiguration!D373)","v":""},null,null,null,{"$f":"IF(B383=\"\",\"\",SUMIF(Ausgaben!B:B,B383,Ausgaben!A:A))","v":""},{"$f":"IF(B383=\"\",\"\",SUMIF(Einnahmen!B:B,B383,Einnahmen!A:A))","v":""}]
[null,{"$f":"IF(Konfiguration!B374=\"\",\"\",Konfiguration!B374)","v":""},null,null,null,{"$f":"IF(Konfiguration!B374=\"\",\"\",Konfiguration!C374)","v":""},{"$f":"IF(Konfiguration!B374=\"\",\"\",Konfiguration!D374)","v":""},null,null,null,{"$f":"IF(B384=\"\",\"\",SUMIF(Ausgaben!B:B,B384,Ausgaben!A:A))","v":""},{"$f":"IF(B384=\"\",\"\",SUMIF(Einnahmen!B:B,B384,Einnahmen!A:A))","v":""}]
[null,{"$f":"IF(Konfiguration!B375=\"\",\"\",Konfiguration!B375)","v":""},null,null,null,{"$f":"IF(Konfiguration!B375=\"\",\"\",Konfiguration!C375)","v":""},{"$f":"IF(Konfiguration!B375=\"\",\"\",Konfiguration!D375)","v":""},null,null,null,{"$f":"IF(B385=\"\",\"\",SUMIF(Ausgaben!B:B,B385,Ausgaben!A:A))","v":""},{"$f":"IF(B385=\"\",\"\",SUMIF(Einnahmen!B:B,B385,Einnahmen!A:A))","v":""}]
[null,{"$f":"IF(Konfiguration!B376=\"\",\"\",Konfiguration!B376)","v":""},null,null,null,{"$f":"IF(Konfiguration!B376=\"\",\"\",Konfiguration!C376)","v":""},{"$f":"IF(Konfiguration!B376=\"\",\"\",Konfiguration!D376)","v":""},null,null,null,{"$f":"IF(B386=\"\",\"\",SUMIF(Ausgaben!B:B,B386,Ausgaben!A:A))","v":""},{"$f":"IF(B386=\"\",\"\",SUMIF(Einnahmen!B:B,B386,Einnahmen!A:A))","v":""}]
[null,{"$f":"IF(Konfiguration!B377=\"\",\"\",Konfiguration!B377)","v":""},null,null,null,{"$f":"IF(Konfiguration!B377=\"\",\"\",Konfiguration!C377)","v":""},{"$f":"IF(Konfiguration!B377=\"\",\"\",Konfiguration!D377)","v":""},null,null,null,{"$f":"IF(B387=\"\",\"\",SUMIF(Ausgaben!B:B,B387,Ausgaben!A:A))","v":""},{"$f":"IF(B387=\"\",\"\",SUMIF(Einnahmen!B:B,B387,Einnahmen!A:A))","v":""}]
[null,{"$f":"IF(Konfiguration!B378=\"\",\"\",Konfiguration!B378)","v":""},null,null,null,{"$f":"IF(Konfiguration!B378=\"\",\"\",Konfiguration!C378)","v":""},{"$f":"IF(Konfiguration!B378=\"\",\"\",Konfiguration!D378)","v":""},null,null,null,{"$f":"IF(B388=\"\",\"\",SUMIF(Ausgaben!B:B,B388,Ausgaben!A:A))","v":""},{"$f":"IF(B388=\"\",\"\",SUMIF(Einnahmen!B:B,B388,Einnahmen!A:A))","v":""}]
[null,{"$f":"IF(Konfiguration!B379=\"\",\"\",Konfiguration!B379)","v":""},null,null,null,{"$f":"IF(Konfiguration!B379=\"\",\"\",Konfiguration!C379)","v":""},{"$f":"IF(Konfiguration!B379=\"\",\"\",Konfiguration!D379)","v":""},null,null,null,{"$f":"IF(B389=\"\",\"\",SUMIF(Ausgaben!B:B,B389,Ausgaben!A:A))","v":""},{"$f":"IF(B389=\"\",\"\",SUMIF(Einnahmen!B:B,B389,Einnahmen!A:A))","v":""}]
[null,{"$f":"IF(Konfiguration!B380=\"\",\"\",Konfiguration!B380)","v":""},null,null,null,{"$f":"IF(Konfiguration!B380=\"\",\"\",Konfiguration!C380)","v":""},{"$f":"IF(Konfiguration!B380=\"\",\"\",Konfiguration!D380)","v":""},null,null,null,{"$f":"IF(B390=\"\",\"\",SUMIF(Ausgaben!B:B,B390,Ausgaben!A:A))","v":""},{"$f":"IF(B390=\"\",\"\",SUMIF(Einnahmen!B:B,B390,Einnahmen!A:A))","v":""}]
[null,{"$f":"IF(Konfiguration!B381=\"\",\"\",Konfiguration!B381)","v":""},null,null,null,{"$f":"IF(Konfiguration!B381=\"\",\"\",Konfiguration!C381)","v":""},{"$f":"IF(Konfiguration!B381=\"\",\"\",Konfiguration!D381)","v":""},null,null,null,{"$f":"IF(B391=\"\",\"\",SUMIF(Ausgaben!B:B,B391,Ausgaben!A:A))","v":""},{"$f":"IF(B391=\"\",\"\",SUMIF(Einnahmen!B:B,B391,Einnahmen!A:A))","v":""}]
[null,{"$f":"IF(Konfiguration!B382=\"\",\"\",Konfiguration!B382)","v":""},null,null,null,{"$f":"IF(Konfiguration!B382=\"\",\"\",Konfiguration!C382)","v":""},{"$f":"IF(Konfiguration!B382=\"\",\"\",Konfiguration!D382)","v":""},null,null,null,{"$f":"IF(B392=\"\",\"\",SUMIF(Ausgaben!B:B,B392,Ausgaben!A:A))","v":""},{"$f":"IF(B392=\"\",\"\",SUMIF(Einnahmen!B:B,B392,Einnahmen!A:A))","v":""}]
[null,{"$f":"IF(Konfiguration!B383=\"\",\"\",Konfiguration!B383)","v":""},null,null,null,{"$f":"IF(Konfiguration!B383=\"\",\"\",Konfiguration!C383)","v":""},{"$f":"IF(Konfiguration!B383=\"\",\"\",Konfiguration!D383)","v":""},null,null,null,{"$f":"IF(B393=\"\",\"\",SUMIF(Ausgaben!B:B,B393,Ausgaben!A:A))","v":""},{"$f":"IF(B393=\"\",\"\",SUMIF(Einnahmen!B:B,B393,Einnahmen!A:A))","v":""}]
[null,{"$f":"IF(Konfiguration!B384=\"\",\"\",Konfiguration!B384)","v":""},null,null,null,{"$f":"IF(Konfiguration!B384=\"\",\"\",Konfiguration!C384)","v":""},{"$f":"IF(Konfiguration!B384=\"\",\"\",Konfiguration!D384)","v":""},null,null,null,{"$f":"IF(B394=\"\",\"\",SUMIF(Ausgaben!B:B,B394,Ausgaben!A:A))","v":""},{"$f":"IF(B394=\"\",\"\",SUMIF(Einnahmen!B:B,B394,Einnahmen!A:A))","v":""}]
[null,{"$f":"IF(Konfiguration!B385=\"\",\"\",Konfiguration!B385)","v":""},null,null,null,{"$f":"IF(Konfiguration!B385=\"\",\"\",Konfiguration!C385)","v":""},{"$f":"IF(Konfiguration!B385=\"\",\"\",Konfiguration!D385)","v":""},null,null,null,{"$f":"IF(B395=\"\",\"\",SUMIF(Ausgaben!B:B,B395,Ausgaben!A:A))","v":""},{"$f":"IF(B395=\"\",\"\",SUMIF(Einnahmen!B:B,B395,Einnahmen!A:A))","v":""}]
[null,{"$f":"IF(Konfiguration!B386=\"\",\"\",Konfiguration!B386)","v":""},null,null,null,{"$f":"IF(Konfiguration!B386=\"\",\"\",Konfiguration!C386)","v":""},{"$f":"IF(Konfiguration!B386=\"\",\"\",Konfiguration!D386)","v":""},null,null,null,{"$f":"IF(B396=\"\",\"\",SUMIF(Ausgaben!B:B,B396,Ausgaben!A:A))","v":""},{"$f":"IF(B396=\"\",\"\",SUMIF(Einnahmen!B:B,B396,Einnahmen!A:A))","v":""}]
[null,{"$f":"IF(Konfiguration!B387=\"\",\"\",Konfiguration!B387)","v":""},null,null,null,{"$f":"IF(Konfiguration!B387=\"\",\"\",Konfiguration!C387)","v":""},{"$f":"IF(Konfiguration!B387=\"\",\"\",Konfiguration!D387)","v":""},null,null,null,{"$f":"IF(B397=\"\",\"\",SUMIF(Ausgaben!B:B,B397,Ausgaben!A:A))","v":""},{"$f":"IF(B397=\"\",\"\",SUMIF(Einnahmen!B:B,B397,Einnahmen!A:A))","v":""}]
[null,{"$f":"IF(Konfiguration!B388=\"\",\"\",Konfiguration!B388)","v":""},null,null,null,{"$f":"IF(Konfiguration!B388=\"\",\"\",Konfiguration!C388)","v":""},{"$f":"IF(Konfiguration!B388=\"\",\"\",Konfiguration!D388)","v":""},null,null,null,{"$f":"IF(B398=\"\",\"\",SUMIF(Ausgaben!B:B,B398,Ausgaben!A:A))","v":""},{"$f":"IF(B398=\"\",\"\",SUMIF(Einnahmen!B:B,B398,Einnahmen!A:A))","v":""}]
[null,{"$f":"IF(Konfiguration!B389=\"\",\"\",Konfiguration!B389)","v":""},null,null,null,{"$f":"IF(Konfiguration!B389=\"\",\"\",Konfiguration!C389)","v":""},{"$f":"IF(Konfiguration!B389=\"\",\"\",Konfiguration!D389)","v":""},null,null,null,{"$f":"IF(B399=\"\",\"\",SUMIF(Ausgaben!B:B,B399,Ausgaben!A:A))","v":""},{"$f":"IF(B399=\"\",\"\",SUMIF(Einnahmen!B:B,B399,Einnahmen!A:A))","v":""}]
[null,{"$f":"IF(Konfiguration!B390=\"\",\"\",Konfiguration!B390)","v":""},null,null,null,{"$f":"IF(Konfiguration!B390=\"\",\"\",Konfiguration!C390)","v":""},{"$f":"IF(Konfiguration!B390=\"\",\"\",Konfiguration!D390)","v":""},null,null,null,{"$f":"IF(B400=\"\",\"\",SUMIF(Ausgaben!B:B,B400,Ausgaben!A:A))","v":""},{"$f":"IF(B400=\"\",\"\",SUMIF(Einnahmen!B:B,B400,Einnahmen!A:A))","v":""}]
[null,{"$f":"IF(Konfiguration!B391=\"\",\"\",Konfiguration!B391)","v":""},null,null,null,{"$f":"IF(Konfiguration!B391=\"\",\"\",Konfiguration!C391)","v":""},{"$f":"IF(Konfiguration!B391=\"\",\"\",Konfiguration!D391)","v":""},null,null,null,{"$f":"IF(B401=\"\",\"\",SUMIF(Ausgaben!B:B,B401,Ausgaben!A:A))","v":""},{"$f":"IF(B401=\"\",\"\",SUMIF(Einnahmen!B:B,B401,Einnahmen!A:A))","v":""}]
[null,{"$f":"IF(Konfiguration!B392=\"\",\"\",Konfiguration!B392)","v":""},null,null,null,{"$f":"IF(Konfiguration!B392=\"\",\"\",Konfiguration!C392)","v":""},{"$f":"IF(Konfiguration!B392=\"\",\"\",Konfiguration!D392)","v":""},null,null,null,{"$f":"IF(B402=\"\",\"\",SUMIF(Ausgaben!B:B,B402,Ausgaben!A:A))","v":""},{"$f":"IF(B402=\"\",\"\",SUMIF(Einnahmen!B:B,B402,Einnahmen!A:A))","v":""}]
[null,{"$f":"IF(Konfiguration!B393=\"\",\"\",Konfiguration!B393)","v":""},null,null,null,{"$f":"IF(Konfiguration!B393=\"\",\"\",Konfiguration!C393)","v":""},{"$f":"IF(Konfiguration!B393=\"\",\"\",Konfiguration!D393)","v":""},null,null,null,{"$f":"IF(B403=\"\",\"\",SUMIF(Ausgaben!B:B,B403,Ausgaben!A:A))","v":""},{"$f":"IF(B403=\"\",\"\",SUMIF(Einnahmen!B:B,B403,Einnahmen!A:A))","v":""}]
[null,{"$f":"IF(Konfiguration!B394=\"\",\"\",Konfiguration!B394)","v":""},null,null,null,{"$f":"IF(Konfiguration!B394=\"\",\"\",Konfiguration!C394)","v":""},{"$f":"IF(Konfiguration!B394=\"\",\"\",Konfiguration!D394)","v":""},null,null,null,{"$f":"IF(B404=\"\",\"\",SUMIF(Ausgaben!B:B,B404,Ausgaben!A:A))","v":""},{"$f":"IF(B404=\"\",\"\",SUMIF(Einnahmen!B:B,B404,Einnahmen!A:A))","v":""}]
[null,{"$f":"IF(Konfiguration!B395=\"\",\"\",Konfiguration!B395)","v":""},null,null,null,{"$f":"IF(Konfiguration!B395=\"\",\"\",Konfiguration!C395)","v":""},{"$f":"IF(Konfiguration!B395=\"\",\"\",Konfiguration!D395)","v":""},null,null,null,{"$f":"IF(B405=\"\",\"\",SUMIF(Ausgaben!B:B,B405,Ausgaben!A:A))","v":""},{"$f":"IF(B405=\"\",\"\",SUMIF(Einnahmen!B:B,B405,Einnahmen!A:A))","v":""}]
[null,{"$f":"IF(Konfiguration!B396=\"\",\"\",Konfiguration!B396)","v":""},null,null,null,{"$f":"IF(Konfiguration!B396=\"\",\"\",Konfiguration!C396)","v":""},{"$f":"IF(Konfiguration!B396=\"\",\"\",Konfiguration!D396)","v":""},null,null,null,{"$f":"IF(B406=\"\",\"\",SUMIF(Ausgaben!B:B,B406,Ausgaben!A:A))","v":""},{"$f":"IF(B406=\"\",\"\",SUMIF(Einnahmen!B:B,B406,Einnahmen!A:A))","v":""}]
[null,{"$f":"IF(Konfiguration!B397=\"\",\"\",Konfiguration!B397)","v":""},null,null,null,{"$f":"IF(Konfiguration!B397=\"\",\"\",Konfiguration!C397)","v":""},{"$f":"IF(Konfiguration!B397=\"\",\"\",Konfiguration!D397)","v":""},null,null,null,{"$f":"IF(B407=\"\",\"\",SUMIF(Ausgaben!B:B,B407,Ausgaben!A:A))","v":""},{"$f":"IF(B407=\"\",\"\",SUMIF(Einnahmen!B:B,B407,Einnahmen!A:A))","v":""}]
[null,{"$f":"IF(Konfiguration!B398=\"\",\"\",Konfiguration!B398)","v":""},null,null,null,{"$f":"IF(Konfiguration!B398=\"\",\"\",Konfiguration!C398)","v":""},{"$f":"IF(Konfiguration!B398=\"\",\"\",Konfiguration!D398)","v":""},null,null,null,{"$f":"IF(B408=\"\",\"\",SUMIF(Ausgaben!B:B,B408,Ausgaben!A:A))","v":""},{"$f":"IF(B408=\"\",\"\",SUMIF(Einnahmen!B:B,B408,Einnahmen!A:A))","v":""}]
[null,{"$f":"IF(Konfiguration!B399=\"\",\"\",Konfiguration!B399)","v":""},null,null,null,{"$f":"IF(Konfiguration!B399=\"\",\"\",Konfiguration!C399)","v":""},{"$f":"IF(Konfiguration!B399=\"\",\"\",Konfiguration!D399)","v":""},null,null,null,{"$f":"IF(B409=\"\",\"\",SUMIF(Ausgaben!B:B,B409,Ausgaben!A:A))","v":""},{"$f":"IF(B409=\"\",\"\",SUMIF(Einnahmen!B:B,B409,Einnahmen!A:A))","v":""}]
[null,{"$f":"IF(Konfiguration!B400=\"\",\"\",Konfiguration!B400)","v":""},null,null,null,{"$f":"IF(Konfiguration!B400=\"\",\"\",Konfiguration!C400)","v":""},{"$f":"IF(Konfiguration!B400=\"\",\"\",Konfiguration!D400)","v":""},null,null,null,{"$f":"IF(B410=\"\",\"\",SUMIF(Ausgaben!B:B,B410,Ausgaben!A:A))","v":""},{"$f":"IF(B410=\"\",\"\",SUMIF(Einnahmen!B:B,B410,Einnahmen!A:A))","v":""}]
[null,{"$f":"IF(Konfiguration!B401=\"\",\"\",Konfiguration!B401)","v":""},null,null,null,{"$f":"IF(Konfiguration!B401=\"\",\"\",Konfiguration!C401)","v":""},{"$f":"IF(Konfiguration!B401=\"\",\"\",Konfiguration!D401)","v":""},null,null,null,{"$f":"IF(B411=\"\",\"\",SUMIF(Ausgaben!B:B,B411,Ausgaben!A:A))","v":""},{"$f":"IF(B411=\"\",\"\",SUMIF(Einnahmen!B:B,B411,Einnahmen!A:A))","v":""}]
[null,{"$f":"IF(Konfiguration!B402=\"\",\"\",Konfiguration!B402)","v":""},null,null,null,{"$f":"IF(Konfiguration!B402=\"\",\"\",Konfiguration!C402)","v":""},{"$f":"IF(Konfiguration!B402=\"\",\"\",Konfiguration!D402)","v":""},null,null,null,{"$f":"IF(B412=\"\",\"\",SUMIF(Ausgaben!B:B,B412,Ausgaben!A:A))","v":""},{"$f":"IF(B412=\"\",\"\",SUMIF(Einnahmen!B:B,B412,Einnahmen!A:A))","v":""}]
[null,{"$f":"IF(Konfiguration!B403=\"\",\"\",Konfiguration!B403)","v":""},null,null,null,{"$f":"IF(Konfiguration!B403=\"\",\"\",Konfiguration!C403)","v":""},{"$f":"IF(Konfiguration!B403=\"\",\"\",Konfiguration!D403)","v":""},null,null,null,{"$f":"IF(B413=\"\",\"\",SUMIF(Ausgaben!B:B,B413,Ausgaben!A:A))","v":""},{"$f":"IF(B413=\"\",\"\",SUMIF(Einnahmen!B:B,B413,Einnahmen!A:A))","v":""}]
[null,{"$f":"IF(Konfiguration!B404=\"\",\"\",Konfiguration!B404)","v":""},null,null,null,{"$f":"IF(Konfiguration!B404=\"\",\"\",Konfiguration!C404)","v":""},{"$f":"IF(Konfiguration!B404=\"\",\"\",Konfiguration!D404)","v":""},null,null,null,{"$f":"IF(B414=\"\",\"\",SUMIF(Ausgaben!B:B,B414,Ausgaben!A:A))","v":""},{"$f":"IF(B414=\"\",\"\",SUMIF(Einnahmen!B:B,B414,Einnahmen!A:A))","v":""}]
[null,{"$f":"IF(Konfiguration!B405=\"\",\"\",Konfiguration!B405)","v":""},null,null,null,{"$f":"IF(Konfiguration!B405=\"\",\"\",Konfiguration!C405)","v":""},{"$f":"IF(Konfiguration!B405=\"\",\"\",Konfiguration!D405)","v":""},null,null,null,{"$f":"IF(B415=\"\",\"\",SUMIF(Ausgaben!B:B,B415,Ausgaben!A:A))","v":""},{"$f":"IF(B415=\"\",\"\",SUMIF(Einnahmen!B:B,B415,Einnahmen!A:A))","v":""}]
[null,{"$f":"IF(Konfiguration!B406=\"\",\"\",Konfiguration!B406)","v":""},null,null,null,{"$f":"IF(Konfiguration!B406=\"\",\"\",Konfiguration!C406)","v":""},{"$f":"IF(Konfiguration!B406=\"\",\"\",Konfiguration!D406)","v":""},null,null,null,{"$f":"IF(B416=\"\",\"\",SUMIF(Ausgaben!B:B,B416,Ausgaben!A:A))","v":""},{"$f":"IF(B416=\"\",\"\",SUMIF(Einnahmen!B:B,B416,Einnahmen!A:A))","v":""}]
[null,{"$f":"IF(Konfiguration!B407=\"\",\"\",Konfiguration!B407)","v":""},null,null,null,{"$f":"IF(Konfiguration!B407=\"\",\"\",Konfiguration!C407)","v":""},{"$f":"IF(Konfiguration!B407=\"\",\"\",Konfiguration!D407)","v":""},null,null,null,{"$f":"IF(B417=\"\",\"\",SUMIF(Ausgaben!B:B,B417,Ausgaben!A:A))","v":""},{"$f":"IF(B417=\"\",\"\",SUMIF(Einnahmen!B:B,B417,Einnahmen!A:A))","v":""}]
[null,{"$f":"IF(Konfiguration!B408=\"\",\"\",Konfiguration!B408)","v":""},null,null,null,{"$f":"IF(Konfiguration!B408=\"\",\"\",Konfiguration!C408)","v":""},{"$f":"IF(Konfiguration!B408=\"\",\"\",Konfiguration!D408)","v":""},null,null,null,{"$f":"IF(B418=\"\",\"\",SUMIF(Ausgaben!B:B,B418,Ausgaben!A:A))","v":""},{"$f":"IF(B418=\"\",\"\",SUMIF(Einnahmen!B:B,B418,Einnahmen!A:A))","v":""}]
[null,{"$f":"IF(Konfiguration!B409=\"\",\"\",Konfiguration!B409)","v":""},null,null,null,{"$f":"IF(Konfiguration!B409=\"\",\"\",Konfiguration!C409)","v":""},{"$f":"IF(Konfiguration!B409=\"\",\"\",Konfiguration!D409)","v":""},null,null,null,{"$f":"IF(B419=\"\",\"\",SUMIF(Ausgaben!B:B,B419,Ausgaben!A:A))","v":""},{"$f":"IF(B419=\"\",\"\",SUMIF(Einnahmen!B:B,B419,Einnahmen!A:A))","v":""}]
[null,{"$f":"IF(Konfiguration!B410=\"\",\"\",Konfiguration!B410)","v":""},null,null,null,{"$f":"IF(Konfiguration!B410=\"\",\"\",Konfiguration!C410)","v":""},{"$f":"IF(Konfiguration!B410=\"\",\"\",Konfiguration!D410)","v":""},null,null,null,{"$f":"IF(B420=\"\",\"\",SUMIF(Ausgaben!B:B,B420,Ausgaben!A:A))","v":""},{"$f":"IF(B420=\"\",\"\",SUMIF(Einnahmen!B:B,B420,Einnahmen!A:A))","v":""}]
[null,{"$f":"IF(Konfiguration!B411=\"\",\"\",Konfiguration!B411)","v":""},null,null,null,{"$f":"IF(Konfiguration!B411=\"\",\"\",Konfiguration!C411)","v":""},{"$f":"IF(Konfiguration!B411=\"\",\"\",Konfiguration!D411)","v":""},null,null,null,{"$f":"IF(B421=\"\",\"\",SUMIF(Ausgaben!B:B,B421,Ausgaben!A:A))","v":""},{"$f":"IF(B421=\"\",\"\",SUMIF(Einnahmen!B:B,B421,Einnahmen!A:A))","v":""}]
[null,{"$f":"IF(Konfiguration!B412=\"\",\"\",Konfiguration!B412)","v":""},null,null,null,{"$f":"IF(Konfiguration!B412=\"\",\"\",Konfiguration!C412)","v":""},{"$f":"IF(Konfiguration!B412=\"\",\"\",Konfiguration!D412)","v":""},null,null,null,{"$f":"IF(B422=\"\",\"\",SUMIF(Ausgaben!B:B,B422,Ausgaben!A:A))","v":""},{"$f":"IF(B422=\"\",\"\",SUMIF(Einnahmen!B:B,B422,Einnahmen!A:A))","v":""}]
[null,{"$f":"IF(Konfiguration!B413=\"\",\"\",Konfiguration!B413)","v":""},null,null,null,{"$f":"IF(Konfiguration!B413=\"\",\"\",Konfiguration!C413)","v":""},{"$f":"IF(Konfiguration!B413=\"\",\"\",Konfiguration!D413)","v":""},null,null,null,{"$f":"IF(B423=\"\",\"\",SUMIF(Ausgaben!B:B,B423,Ausgaben!A:A))","v":""},{"$f":"IF(B423=\"\",\"\",SUMIF(Einnahmen!B:B,B423,Einnahmen!A:A))","v":""}]
[null,{"$f":"IF(Konfiguration!B414=\"\",\"\",Konfiguration!B414)","v":""},null,null,null,{"$f":"IF(Konfiguration!B414=\"\",\"\",Konfiguration!C414)","v":""},{"$f":"IF(Konfiguration!B414=\"\",\"\",Konfiguration!D414)","v":""},null,null,null,{"$f":"IF(B424=\"\",\"\",SUMIF(Ausgaben!B:B,B424,Ausgaben!A:A))","v":""},{"$f":"IF(B424=\"\",\"\",SUMIF(Einnahmen!B:B,B424,Einnahmen!A:A))","v":""}]
[null,{"$f":"IF(Konfiguration!B415=\"\",\"\",Konfiguration!B415)","v":""},null,null,null,{"$f":"IF(Konfiguration!B415=\"\",\"\",Konfiguration!C415)","v":""},{"$f":"IF(Konfiguration!B415=\"\",\"\",Konfiguration!D415)","v":""},null,null,null,{"$f":"IF(B425=\"\",\"\",SUMIF(Ausgaben!B:B,B425,Ausgaben!A:A))","v":""},{"$f":"IF(B425=\"\",\"\",SUMIF(Einnahmen!B:B,B425,Einnahmen!A:A))","v":""}]
[null,{"$f":"IF(Konfiguration!B416=\"\",\"\",Konfiguration!B416)","v":""},null,null,null,{"$f":"IF(Konfiguration!B416=\"\",\"\",Konfiguration!C416)","v":""},{"$f":"IF(Konfiguration!B416=\"\",\"\",Konfiguration!D416)","v":""},null,null,null,{"$f":"IF(B426=\"\",\"\",SUMIF(Ausgaben!B:B,B426,Ausgaben!A:A))","v":""},{"$f":"IF(B426=\"\",\"\",SUMIF(Einnahmen!B:B,B426,Einnahmen!A:A))","v":""}]
[null,{"$f":"IF(Konfiguration!B417=\"\",\"\",Konfiguration!B417)","v":""},null,null,null,{"$f":"IF(Konfiguration!B417=\"\",\"\",Konfiguration!C417)","v":""},{"$f":"IF(Konfiguration!B417=\"\",\"\",Konfiguration!D417)","v":""},null,null,null,{"$f":"IF(B427=\"\",\"\",SUMIF(Ausgaben!B:B,B427,Ausgaben!A:A))","v":""},{"$f":"IF(B427=\"\",\"\",SUMIF(Einnahmen!B:B,B427,Einnahmen!A:A))","v":""}]
[null,{"$f":"IF(Konfiguration!B418=\"\",\"\",Konfiguration!B418)","v":""},null,null,null,{"$f":"IF(Konfiguration!B418=\"\",\"\",Konfiguration!C418)","v":""},{"$f":"IF(Konfiguration!B418=\"\",\"\",Konfiguration!D418)","v":""},null,null,null,{"$f":"IF(B428=\"\",\"\",SUMIF(Ausgaben!B:B,B428,Ausgaben!A:A))","v":""},{"$f":"IF(B428=\"\",\"\",SUMIF(Einnahmen!B:B,B428,Einnahmen!A:A))","v":""}]
[null,{"$f":"IF(Konfiguration!B419=\"\",\"\",Konfiguration!B419)","v":""},null,null,null,{"$f":"IF(Konfiguration!B419=\"\",\"\",Konfiguration!C419)","v":""},{"$f":"IF(Konfiguration!B419=\"\",\"\",Konfiguration!D419)","v":""},null,null,null,{"$f":"IF(B429=\"\",\"\",SUMIF(Ausgaben!B:B,B429,Ausgaben!A:A))","v":""},{"$f":"IF(B429=\"\",\"\",SUMIF(Einnahmen!B:B,B429,Einnahmen!A:A))","v":""}]
[null,{"$f":"IF(Konfiguration!B420=\"\",\"\",Konfiguration!B420)","v":""},null,null,null,{"$f":"IF(Konfiguration!B420=\"\",\"\",Konfiguration!C420)","v":""},{"$f":"IF(Konfiguration!B420=\"\",\"\",Konfiguration!D420)","v":""},null,null,null,{"$f":"IF(B430=\"\",\"\",SUMIF(Ausgaben!B:B,B430,Ausgaben!A:A))","v":""},{"$f":"IF(B430=\"\",\"\",SUMIF(Einnahmen!B:B,B430,Einnahmen!A:A))","v":""}]
[null,{"$f":"IF(Konfiguration!B421=\"\",\"\",Konfiguration!B421)","v":""},null,null,null,{"$f":"IF(Konfiguration!B421=\"\",\"\",Konfiguration!C421)","v":""},{"$f":"IF(Konfiguration!B421=\"\",\"\",Konfiguration!D421)","v":""},null,null,null,{"$f":"IF(B431=\"\",\"\",SUMIF(Ausgaben!B:B,B431,Ausgaben!A:A))","v":""},{"$f":"IF(B431=\"\",\"\",SUMIF(Einnahmen!B:B,B431,Einnahmen!A:A))","v":""}]
[null,{"$f":"IF(Konfiguration!B422=\"\",\"\",Konfiguration!B422)","v":""},null,null,null,{"$f":"IF(Konfiguration!B422=\"\",\"\",Konfiguration!C422)","v":""},{"$f":"IF(Konfiguration!B422=\"\",\"\",Konfiguration!D422)","v":""},null,null,null,{"$f":"IF(B432=\"\",\"\",SUMIF(Ausgaben!B:B,B432,Ausgaben!A:A))","v":""},{"$f":"IF(B432=\"\",\"\",SUMIF(Einnahmen!B:B,B432,Einnahmen!A:A))","v":""}]
[null,{"$f":"IF(Konfiguration!B423=\"\",\"\",Konfiguration!B423)","v":""},null,null,null,{"$f":"IF(Konfiguration!B423=\"\",\"\",Konfiguration!C423)","v":""},{"$f":"IF(Konfiguration!B423=\"\",\"\",Konfiguration!D423)","v":""},null,null,null,{"$f":"IF(B433=\"\",\"\",SUMIF(Ausgaben!B:B,B433,Ausgaben!A:A))","v":""},{"$f":"IF(B433=\"\",\"\",SUMIF(Einnahmen!B:B,B433,Einnahmen!A:A))","v":""}]
[null,{"$f":"IF(Konfiguration!B424=\"\",\"\",Konfiguration!B424)","v":""},null,null,null,{"$f":"IF(Konfiguration!B424=\"\",\"\",Konfiguration!C424)","v":""},{"$f":"IF(Konfiguration!B424=\"\",\"\",Konfiguration!D424)","v":""},null,null,null,{"$f":"IF(B434=\"\",\"\",SUMIF(Ausgaben!B:B,B434,Ausgaben!A:A))","v":""},{"$f":"IF(B434=\"\",\"\",SUMIF(Einnahmen!B:B,B434,Einnahmen!A:A))","v":""}]
[null,{"$f":"IF(Konfiguration!B425=\"\",\"\",Konfiguration!B425)","v":""},null,null,null,{"$f":"IF(Konfiguration!B425=\"\",\"\",Konfiguration!C425)","v":""},{"$f":"IF(Konfiguration!B425=\"\",\"\",Konfiguration!D425)","v":""},null,null,null,{"$f":"IF(B435=\"\",\"\",SUMIF(Ausgaben!B:B,B435,Ausgaben!A:A))","v":""},{"$f":"IF(B435=\"\",\"\",SUMIF(Einnahmen!B:B,B435,Einnahmen!A:A))","v":""}]
[null,{"$f":"IF(Konfiguration!B426=\"\",\"\",Konfiguration!B426)","v":""},null,null,null,{"$f":"IF(Konfiguration!B426=\"\",\"\",Konfiguration!C426)","v":""},{"$f":"IF(Konfiguration!B426=\"\",\"\",Konfiguration!D426)","v":""},null,null,null,{"$f":"IF(B436=\"\",\"\",SUMIF(Ausgaben!B:B,B436,Ausgaben!A:A))","v":""},{"$f":"IF(B436=\"\",\"\",SUMIF(Einnahmen!B:B,B436,Einnahmen!A:A))","v":""}]
[null,{"$f":"IF(Konfiguration!B427=\"\",\"\",Konfiguration!B427)","v":""},null,null,null,{"$f":"IF(Konfiguration!B427=\"\",\"\",Konfiguration!C427)","v":""},{"$f":"IF(Konfiguration!B427=\"\",\"\",Konfiguration!D427)","v":""},null,null,null,{"$f":"IF(B437=\"\",\"\",SUMIF(Ausgaben!B:B,B437,Ausgaben!A:A))","v":""},{"$f":"IF(B437=\"\",\"\",SUMIF(Einnahmen!B:B,B437,Einnahmen!A:A))","v":""}]
[null,{"$f":"IF(Konfiguration!B428=\"\",\"\",Konfiguration!B428)","v":""},null,null,null,{"$f":"IF(Konfiguration!B428=\"\",\"\",Konfiguration!C428)","v":""},{"$f":"IF(Konfiguration!B428=\"\",\"\",Konfiguration!D428)","v":""},null,null,null,{"$f":"IF(B438=\"\",\"\",SUMIF(Ausgaben!B:B,B438,Ausgaben!A:A))","v":""},{"$f":"IF(B438=\"\",\"\",SUMIF(Einnahmen!B:B,B438,Einnahmen!A:A))","v":""}]
[null,{"$f":"IF(Konfiguration!B429=\"\",\"\",Konfiguration!B429)","v":""},null,null,null,{"$f":"IF(Konfiguration!B429=\"\",\"\",Konfiguration!C429)","v":""},{"$f":"IF(Konfiguration!B429=\"\",\"\",Konfiguration!D429)","v":""},null,null,null,{"$f":"IF(B439=\"\",\"\",SUMIF(Ausgaben!B:B,B439,Ausgaben!A:A))","v":""},{"$f":"IF(B439=\"\",\"\",SUMIF(Einnahmen!B:B,B439,Einnahmen!A:A))","v":""}]
[null,{"$f":"IF(Konfiguration!B430=\"\",\"\",Konfiguration!B430)","v":""},null,null,null,{"$f":"IF(Konfiguration!B430=\"\",\"\",Konfiguration!C430)","v":""},{"$f":"IF(Konfiguration!B430=\"\",\"\",Konfiguration!D430)","v":""},null,null,null,{"$f":"IF(B440=\"\",\"\",SUMIF(Ausgaben!B:B,B440,Ausgaben!A:A))","v":""},{"$f":"IF(B440=\"\",\"\",SUMIF(Einnahmen!B:B,B440,Einnahmen!A:A))","v":""}]
[null,{"$f":"IF(Konfiguration!B431=\"\",\"\",Konfiguration!B431)","v":""},null,null,null,{"$f":"IF(Konfiguration!B431=\"\",\"\",Konfiguration!C431)","v":""},{"$f":"IF(Konfiguration!B431=\"\",\"\",Konfiguration!D431)","v":""},null,null,null,{"$f":"IF(B441=\"\",\"\",SUMIF(Ausgaben!B:B,B441,Ausgaben!A:A))","v":""},{"$f":"IF(B441=\"\",\"\",SUMIF(Einnahmen!B:B,B441,Einnahmen!A:A))","v":""}]
[null,{"$f":"IF(Konfiguration!B432=\"\",\"\",Konfiguration!B432)","v":""},null,null,null,{"$f":"IF(Konfiguration!B432=\"\",\"\",Konfiguration!C432)","v":""},{"$f":"IF(Konfiguration!B432=\"\",\"\",Konfiguration!D432)","v":""},null,null,null,{"$f":"IF(B442=\"\",\"\",SUMIF(Ausgaben!B:B,B442,Ausgaben!A:A))","v":""},{"$f":"IF(B442=\"\",\"\",SUMIF(Einnahmen!B:B,B442,Einnahmen!A:A))","v":""}]
[null,{"$f":"IF(Konfiguration!B433=\"\",\"\",Konfiguration!B433)","v":""},null,null,null,{"$f":"IF(Konfiguration!B433=\"\",\"\",Konfiguration!C433)","v":""},{"$f":"IF(Konfiguration!B433=\"\",\"\",Konfiguration!D433)","v":""},null,null,null,{"$f":"IF(B443=\"\",\"\",SUMIF(Ausgaben!B:B,B443,Ausgaben!A:A))","v":""},{"$f":"IF(B443=\"\",\"\",SUMIF(Einnahmen!B:B,B443,Einnahmen!A:A))","v":""}]
[null,{"$f":"IF(Konfiguration!B434=\"\",\"\",Konfiguration!B434)","v":""},null,null,null,{"$f":"IF(Konfiguration!B434=\"\",\"\",Konfiguration!C434)","v":""},{"$f":"IF(Konfiguration!B434=\"\",\"\",Konfiguration!D434)","v":""},null,null,null,{"$f":"IF(B444=\"\",\"\",SUMIF(Ausgaben!B:B,B444,Ausgaben!A:A))","v":""},{"$f":"IF(B444=\"\",\"\",SUMIF(Einnahmen!B:B,B444,Einnahmen!A:A))","v":""}]
[null,{"$f":"IF(Konfiguration!B435=\"\",\"\",Konfiguration!B435)","v":""},null,null,null,{"$f":"IF(Konfiguration!B435=\"\",\"\",Konfiguration!C435)","v":""},{"$f":"IF(Konfiguration!B435=\"\",\"\",Konfiguration!D435)","v":""},null,null,null,{"$f":"IF(B445=\"\",\"\",SUMIF(Ausgaben!B:B,B445,Ausgaben!A:A))","v":""},{"$f":"IF(B445=\"\",\"\",SUMIF(Einnahmen!B:B,B445,Einnahmen!A:A))","v":""}]
[null,{"$f":"IF(Konfiguration!B436=\"\",\"\",Konfiguration!B436)","v":""},null,null,null,{"$f":"IF(Konfiguration!B436=\"\",\"\",Konfiguration!C436)","v":""},{"$f":"IF(Konfiguration!B436=\"\",\"\",Konfiguration!D436)","v":""},null,null,null,{"$f":"IF(B446=\"\",\"\",SUMIF(Ausgaben!B:B,B446,Ausgaben!A:A))","v":""},{"$f":"IF(B446=\"\",\"\",SUMIF(Einnahmen!B:B,B446,Einnahmen!A:A))","v":""}]
[null,{"$f":"IF(Konfiguration!B437=\"\",\"\",Konfiguration!B437)","v":""},null,null,null,{"$f":"IF(Konfiguration!B437=\"\",\"\",Konfiguration!C437)","v":""},{"$f":"IF(Konfiguration!B437=\"\",\"\",Konfiguration!D437)","v":""},null,null,null,{"$f":"IF(B447=\"\",\"\",SUMIF(Ausgaben!B:B,B447,Ausgaben!A:A))","v":""},{"$f":"IF(B447=\"\",\"\",SUMIF(Einnahmen!B:B,B447,Einnahmen!A:A))","v":""}]
[null,{"$f":"IF(Konfiguration!B438=\"\",\"\",Konfiguration!B438)","v":""},null,null,null,{"$f":"IF(Konfiguration!B438=\"\",\"\",Konfiguration!C438)","v":""},{"$f":"IF(Konfiguration!B438=\"\",\"\",Konfiguration!D438)","v":""},null,null,null,{"$f":"IF(B448=\"\",\"\",SUMIF(Ausgaben!B:B,B448,Ausgaben!A:A))","v":""},{"$f":"IF(B448=\"\",\"\",SUMIF(Einnahmen!B:B,B448,Einnahmen!A:A))","v":""}]
[null,{"$f":"IF(Konfiguration!B439=\"\",\"\",Konfiguration!B439)","v":""},null,null,null,{"$f":"IF(Konfiguration!B439=\"\",\"\",Konfiguration!C439)","v":""},{"$f":"IF(Konfiguration!B439=\"\",\"\",Konfiguration!D439)","v":""},null,null,null,{"$f":"IF(B449=\"\",\"\",SUMIF(Ausgaben!B:B,B449,Ausgaben!A:A))","v":""},{"$f":"IF(B449=\"\",\"\",SUMIF(Einnahmen!B:B,B449,Einnahmen!A:A))","v":""}]
[null,{"$f":"IF(Konfiguration!B440=\"\",\"\",Konfiguration!B440)","v":""},null,null,null,{"$f":"IF(Konfiguration!B440=\"\",\"\",Konfiguration!C440)","v":""},{"$f":"IF(Konfiguration!B440=\"\",\"\",Konfiguration!D440)","v":""},null,null,null,{"$f":"IF(B450=\"\",\"\",SUMIF(Ausgaben!B:B,B450,Ausgaben!A:A))","v":""},{"$f":"IF(B450=\"\",\"\",SUMIF(Einnahmen!B:B,B450,Einnahmen!A:A))","v":""}]
[null,{"$f":"IF(Konfiguration!B441=\"\",\"\",Konfiguration!B441)","v":""},null,null,null,{"$f":"IF(Konfiguration!B441=\"\",\"\",Konfiguration!C441)","v":""},{"$f":"IF(Konfiguration!B441=\"\",\"\",Konfiguration!D441)","v":""},null,null,null,{"$f":"IF(B451=\"\",\"\",SUMIF(Ausgaben!B:B,B451,Ausgaben!A:A))","v":""},{"$f":"IF(B451=\"\",\"\",SUMIF(Einnahmen!B:B,B451,Einnahmen!A:A))","v":""}]
[null,{"$f":"IF(Konfiguration!B442=\"\",\"\",Konfiguration!B442)","v":""},null,null,null,{"$f":"IF(Konfiguration!B442=\"\",\"\",Konfiguration!C442)","v":""},{"$f":"IF(Konfiguration!B442=\"\",\"\",Konfiguration!D442)","v":""},null,null,null,{"$f":"IF(B452=\"\",\"\",SUMIF(Ausgaben!B:B,B452,Ausgaben!A:A))","v":""},{"$f":"IF(B452=\"\",\"\",SUMIF(Einnahmen!B:B,B452,Einnahmen!A:A))","v":""}]
[null,{"$f":"IF(Konfiguration!B443=\"\",\"\",Konfiguration!B443)","v":""},null,null,null,{"$f":"IF(Konfiguration!B443=\"\",\"\",Konfiguration!C443)","v":""},{"$f":"IF(Konfiguration!B443=\"\",\"\",Konfiguration!D443)","v":""},null,null,null,{"$f":"IF(B453=\"\",\"\",SUMIF(Ausgaben!B:B,B453,Ausgaben!A:A))","v":""},{"$f":"IF(B453=\"\",\"\",SUMIF(Einnahmen!B:B,B453,Einnahmen!A:A))","v":""}]
[null,{"$f":"IF(Konfiguration!B444=\"\",\"\",Konfiguration!B444)","v":""},null,null,null,{"$f":"IF(Konfiguration!B444=\"\",\"\",Konfiguration!C444)","v":""},{"$f":"IF(Konfiguration!B444=\"\",\"\",Konfiguration!D444)","v":""},null,null,null,{"$f":"IF(B454=\"\",\"\",SUMIF(Ausgaben!B:B,B454,Ausgaben!A:A))","v":""},{"$f":"IF(B454=\"\",\"\",SUMIF(Einnahmen!B:B,B454,Einnahmen!A:A))","v":""}]
[null,{"$f":"IF(Konfiguration!B445=\"\",\"\",Konfiguration!B445)","v":""},null,null,null,{"$f":"IF(Konfiguration!B445=\"\",\"\",Konfiguration!C445)","v":""},{"$f":"IF(Konfiguration!B445=\"\",\"\",Konfiguration!D445)","v":""},null,null,null,{"$f":"IF(B455=\"\",\"\",SUMIF(Ausgaben!B:B,B455,Ausgaben!A:A))","v":""},{"$f":"IF(B455=\"\",\"\",SUMIF(Einnahmen!B:B,B455,Einnahmen!A:A))","v":""}]
[null,{"$f":"IF(Konfiguration!B446=\"\",\"\",Konfiguration!B446)","v":""},null,null,null,{"$f":"IF(Konfiguration!B446=\"\",\"\",Konfiguration!C446)","v":""},{"$f":"IF(Konfiguration!B446=\"\",\"\",Konfiguration!D446)","v":""},null,null,null,{"$f":"IF(B456=\"\",\"\",SUMIF(Ausgaben!B:B,B456,Ausgaben!A:A))","v":""},{"$f":"IF(B456=\"\",\"\",SUMIF(Einnahmen!B:B,B456,Einnahmen!A:A))","v":""}]
[null,{"$f":"IF(Konfiguration!B447=\"\",\"\",Konfiguration!B447)","v":""},null,null,null,{"$f":"IF(Konfiguration!B447=\"\",\"\",Konfiguration!C447)","v":""},{"$f":"IF(Konfiguration!B447=\"\",\"\",Konfiguration!D447)","v":""},null,null,null,{"$f":"IF(B457=\"\",\"\",SUMIF(Ausgaben!B:B,B457,Ausgaben!A:A))","v":""},{"$f":"IF(B457=\"\",\"\",SUMIF(Einnahmen!B:B,B457,Einnahmen!A:A))","v":""}]
[null,{"$f":"IF(Konfiguration!B448=\"\",\"\",Konfiguration!B448)","v":""},null,null,null,{"$f":"IF(Konfiguration!B448=\"\",\"\",Konfiguration!C448)","v":""},{"$f":"IF(Konfiguration!B448=\"\",\"\",Konfiguration!D448)","v":""},null,null,null,{"$f":"IF(B458=\"\",\"\",SUMIF(Ausgaben!B:B,B458,Ausgaben!A:A))","v":""},{"$f":"IF(B458=\"\",\"\",SUMIF(Einnahmen!B:B,B458,Einnahmen!A:A))","v":""}]
[null,{"$f":"IF(Konfiguration!B449=\"\",\"\",Konfiguration!B449)","v":""},null,null,null,{"$f":"IF(Konfiguration!B449=\"\",\"\",Konfiguration!C449)","v":""},{"$f":"IF(Konfiguration!B449=\"\",\"\",Konfiguration!D449)","v":""},null,null,null,{"$f":"IF(B459=\"\",\"\",SUMIF(Ausgaben!B:B,B459,Ausgaben!A:A))","v":""},{"$f":"IF(B459=\"\",\"\",SUMIF(Einnahmen!B:B,B459,Einnahmen!A:A))","v":""}]
[null,{"$f":"IF(Konfiguration!B450=\"\",\"\",Konfiguration!B450)","v":""},null,null,null,{"$f":"IF(Konfiguration!B450=\"\",\"\",Konfiguration!C450)","v":""},{"$f":"IF(Konfiguration!B450=\"\",\"\",Konfiguration!D450)","v":""},null,null,null,{"$f":"IF(B460=\"\",\"\",SUMIF(Ausgaben!B:B,B460,Ausgaben!A:A))","v":""},{"$f":"IF(B460=\"\",\"\",SUMIF(Einnahmen!B:B,B460,Einnahmen!A:A))","v":""}]
[null,{"$f":"IF(Konfiguration!B451=\"\",\"\",Konfiguration!B451)","v":""},null,null,null,{"$f":"IF(Konfiguration!B451=\"\",\"\",Konfiguration!C451)","v":""},{"$f":"IF(Konfiguration!B451=\"\",\"\",Konfiguration!D451)","v":""},null,null,null,{"$f":"IF(B461=\"\",\"\",SUMIF(Ausgaben!B:B,B461,Ausgaben!A:A))","v":""},{"$f":"IF(B461=\"\",\"\",SUMIF(Einnahmen!B:B,B461,Einnahmen!A:A))","v":""}]
[null,{"$f":"IF(Konfiguration!B452=\"\",\"\",Konfiguration!B452)","v":""},null,null,null,{"$f":"IF(Konfiguration!B452=\"\",\"\",Konfiguration!C452)","v":""},{"$f":"IF(Konfiguration!B452=\"\",\"\",Konfiguration!D452)","v":""},null,null,null,{"$f":"IF(B462=\"\",\"\",SUMIF(Ausgaben!B:B,B462,Ausgaben!A:A))","v":""},{"$f":"IF(B462=\"\",\"\",SUMIF(Einnahmen!B:B,B462,Einnahmen!A:A))","v":""}]
[null,{"$f":"IF(Konfiguration!B453=\"\",\"\",Konfiguration!B453)","v":""},null,null,null,{"$f":"IF(Konfiguration!B453=\"\",\"\",Konfiguration!C453)","v":""},{"$f":"IF(Konfiguration!B453=\"\",\"\",Konfiguration!D453)","v":""},null,null,null,{"$f":"IF(B463=\"\",\"\",SUMIF(Ausgaben!B:B,B463,Ausgaben!A:A))","v":""},{"$f":"IF(B463=\"\",\"\",SUMIF(Einnahmen!B:B,B463,Einnahmen!A:A))","v":""}]
[null,{"$f":"IF(Konfiguration!B454=\"\",\"\",Konfiguration!B454)","v":""},null,null,null,{"$f":"IF(Konfiguration!B454=\"\",\"\",Konfiguration!C454)","v":""},{"$f":"IF(Konfiguration!B454=\"\",\"\",Konfiguration!D454)","v":""},null,null,null,{"$f":"IF(B464=\"\",\"\",SUMIF(Ausgaben!B:B,B464,Ausgaben!A:A))","v":""},{"$f":"IF(B464=\"\",\"\",SUMIF(Einnahmen!B:B,B464,Einnahmen!A:A))","v":""}]
[null,{"$f":"IF(Konfiguration!B455=\"\",\"\",Konfiguration!B455)","v":""},null,null,null,{"$f":"IF(Konfiguration!B455=\"\",\"\",Konfiguration!C455)","v":""},{"$f":"IF(Konfiguration!B455=\"\",\"\",Konfiguration!D455)","v":""},null,null,null,{"$f":"IF(B465=\"\",\"\",SUMIF(Ausgaben!B:B,B465,Ausgaben!A:A))","v":""},{"$f":"IF(B465=\"\",\"\",SUMIF(Einnahmen!B:B,B465,Einnahmen!A:A))","v":""}]
[null,{"$f":"IF(Konfiguration!B456=\"\",\"\",Konfiguration!B456)","v":""},null,null,null,{"$f":"IF(Konfiguration!B456=\"\",\"\",Konfiguration!C456)","v":""},{"$f":"IF(Konfiguration!B456=\"\",\"\",Konfiguration!D456)","v":""},null,null,null,{"$f":"IF(B466=\"\",\"\",SUMIF(Ausgaben!B:B,B466,Ausgaben!A:A))","v":""},{"$f":"IF(B466=\"\",\"\",SUMIF(Einnahmen!B:B,B466,Einnahmen!A:A))","v":""}]
[null,{"$f":"IF(Konfiguration!B457=\"\",\"\",Konfiguration!B457)","v":""},null,null,null,{"$f":"IF(Konfiguration!B457=\"\",\"\",Konfiguration!C457)","v":""},{"$f":"IF(Konfiguration!B457=\"\",\"\",Konfiguration!D457)","v":""},null,null,null,{"$f":"IF(B467=\"\",\"\",SUMIF(Ausgaben!B:B,B467,Ausgaben!A:A))","v":""},{"$f":"IF(B467=\"\",\"\",SUMIF(Einnahmen!B:B,B467,Einnahmen!A:A))","v":""}]
[null,{"$f":"IF(Konfiguration!B458=\"\",\"\",Konfiguration!B458)","v":""},null,null,null,{"$f":"IF(Konfiguration!B458=\"\",\"\",Konfiguration!C458)","v":""},{"$f":"IF(Konfiguration!B458=\"\",\"\",Konfiguration!D458)","v":""},null,null,null,{"$f":"IF(B468=\"\",\"\",SUMIF(Ausgaben!B:B,B468,Ausgaben!A:A))","v":""},{"$f":"IF(B468=\"\",\"\",SUMIF(Einnahmen!B:B,B468,Einnahmen!A:A))","v":""}]
[null,{"$f":"IF(Konfiguration!B459=\"\",\"\",Konfiguration!B459)","v":""},null,null,null,{"$f":"IF(Konfiguration!B459=\"\",\"\",Konfiguration!C459)","v":""},{"$f":"IF(Konfiguration!B459=\"\",\"\",Konfiguration!D459)","v":""},null,null,null,{"$f":"IF(B469=\"\",\"\",SUMIF(Ausgaben!B:B,B469,Ausgaben!A:A))","v":""},{"$f":"IF(B469=\"\",\"\",SUMIF(Einnahmen!B:B,B469,Einnahmen!A:A))","v":""}]
[null,{"$f":"IF(Konfiguration!B460=\"\",\"\",Konfiguration!B460)","v":""},null,null,null,{"$f":"IF(Konfiguration!B460=\"\",\"\",Konfiguration!C460)","v":""},{"$f":"IF(Konfiguration!B460=\"\",\"\",Konfiguration!D460)","v":""},null,null,null,{"$f":"IF(B470=\"\",\"\",SUMIF(Ausgaben!B:B,B470,Ausgaben!A:A))","v":""},{"$f":"IF(B470=\"\",\"\",SUMIF(Einnahmen!B:B,B470,Einnahmen!A:A))","v":""}]
[null,{"$f":"IF(Konfiguration!B461=\"\",\"\",Konfiguration!B461)","v":""},null,null,null,{"$f":"IF(Konfiguration!B461=\"\",\"\",Konfiguration!C461)","v":""},{"$f":"IF(Konfiguration!B461=\"\",\"\",Konfiguration!D461)","v":""},null,null,null,{"$f":"IF(B471=\"\",\"\",SUMIF(Ausgaben!B:B,B471,Ausgaben!A:A))","v":""},{"$f":"IF(B471=\"\",\"\",SUMIF(Einnahmen!B:B,B471,Einnahmen!A:A))","v":""}]
[null,{"$f":"IF(Konfiguration!B462=\"\",\"\",Konfiguration!B462)","v":""},null,null,null,{"$f":"IF(Konfiguration!B462=\"\",\"\",Konfiguration!C462)","v":""},{"$f":"IF(Konfiguration!B462=\"\",\"\",Konfiguration!D462)","v":""},null,null,null,{"$f":"IF(B472=\"\",\"\",SUMIF(Ausgaben!B:B,B472,Ausgaben!A:A))","v":""},{"$f":"IF(B472=\"\",\"\",SUMIF(Einnahmen!B:B,B472,Einnahmen!A:A))","v":""}]
[null,{"$f":"IF(Konfiguration!B463=\"\",\"\",Konfiguration!B463)","v":""},null,null,null,{"$f":"IF(Konfiguration!B463=\"\",\"\",Konfiguration!C463)","v":""},{"$f":"IF(Konfiguration!B463=\"\",\"\",Konfiguration!D463)","v":""},null,null,null,{"$f":"IF(B473=\"\",\"\",SUMIF(Ausgaben!B:B,B473,Ausgaben!A:A))","v":""},{"$f":"IF(B473=\"\",\"\",SUMIF(Einnahmen!B:B,B473,Einnahmen!A:A))","v":""}]
[null,{"$f":"IF(Konfiguration!B464=\"\",\"\",Konfiguration!B464)","v":""},null,null,null,{"$f":"IF(Konfiguration!B464=\"\",\"\",Konfiguration!C464)","v":""},{"$f":"IF(Konfiguration!B464=\"\",\"\",Konfiguration!D464)","v":""},null,null,null,{"$f":"IF(B474=\"\",\"\",SUMIF(Ausgaben!B:B,B474,Ausgaben!A:A))","v":""},{"$f":"IF(B474=\"\",\"\",SUMIF(Einnahmen!B:B,B474,Einnahmen!A:A))","v":""}]
[null,{"$f":"IF(Konfiguration!B465=\"\",\"\",Konfiguration!B465)","v":""},null,null,null,{"$f":"IF(Konfiguration!B465=\"\",\"\",Konfiguration!C465)","v":""},{"$f":"IF(Konfiguration!B465=\"\",\"\",Konfiguration!D465)","v":""},null,null,null,{"$f":"IF(B475=\"\",\"\",SUMIF(Ausgaben!B:B,B475,Ausgaben!A:A))","v":""},{"$f":"IF(B475=\"\",\"\",SUMIF(Einnahmen!B:B,B475,Einnahmen!A:A))","v":""}]
[null,{"$f":"IF(Konfiguration!B466=\"\",\"\",Konfiguration!B466)","v":""},null,null,null,{"$f":"IF(Konfiguration!B466=\"\",\"\",Konfiguration!C466)","v":""},{"$f":"IF(Konfiguration!B466=\"\",\"\",Konfiguration!D466)","v":""},null,null,null,{"$f":"IF(B476=\"\",\"\",SUMIF(Ausgaben!B:B,B476,Ausgaben!A:A))","v":""},{"$f":"IF(B476=\"\",\"\",SUMIF(Einnahmen!B:B,B476,Einnahmen!A:A))","v":""}]
[null,{"$f":"IF(Konfiguration!B467=\"\",\"\",Konfiguration!B467)","v":""},null,null,null,{"$f":"IF(Konfiguration!B467=\"\",\"\",Konfiguration!C467)","v":""},{"$f":"IF(Konfiguration!B467=\"\",\"\",Konfiguration!D467)","v":""},null,null,null,{"$f":"IF(B477=\"\",\"\",SUMIF(Ausgaben!B:B,B477,Ausgaben!A:A))","v":""},{"$f":"IF(B477=\"\",\"\",SUMIF(Einnahmen!B:B,B477,Einnahmen!A:A))","v":""}]
[null,{"$f":"IF(Konfiguration!B468=\"\",\"\",Konfiguration!B468)","v":""},null,null,null,{"$f":"IF(Konfiguration!B468=\"\",\"\",Konfiguration!C468)","v":""},{"$f":"IF(Konfiguration!B468=\"\",\"\",Konfiguration!D468)","v":""},null,null,null,{"$f":"IF(B478=\"\",\"\",SUMIF(Ausgaben!B:B,B478,Ausgaben!A:A))","v":""},{"$f":"IF(B478=\"\",\"\",SUMIF(Einnahmen!B:B,B478,Einnahmen!A:A))","v":""}]
[null,{"$f":"IF(Konfiguration!B469=\"\",\"\",Konfiguration!B469)","v":""},null,null,null,{"$f":"IF(Konfiguration!B469=\"\",\"\",Konfiguration!C469)","v":""},{"$f":"IF(Konfiguration!B469=\"\",\"\",Konfiguration!D469)","v":""},null,null,null,{"$f":"IF(B479=\"\",\"\",SUMIF(Ausgaben!B:B,B479,Ausgaben!A:A))","v":""},{"$f":"IF(B479=\"\",\"\",SUMIF(Einnahmen!B:B,B479,Einnahmen!A:A))","v":""}]
[null,{"$f":"IF(Konfiguration!B470=\"\",\"\",Konfiguration!B470)","v":""},null,null,null,{"$f":"IF(Konfiguration!B470=\"\",\"\",Konfiguration!C470)","v":""},{"$f":"IF(Konfiguration!B470=\"\",\"\",Konfiguration!D470)","v":""},null,null,null,{"$f":"IF(B480=\"\",\"\",SUMIF(Ausgaben!B:B,B480,Ausgaben!A:A))","v":""},{"$f":"IF(B480=\"\",\"\",SUMIF(Einnahmen!B:B,B480,Einnahmen!A:A))","v":""}]
[null,{"$f":"IF(Konfiguration!B471=\"\",\"\",Konfiguration!B471)","v":""},null,null,null,{"$f":"IF(Konfiguration!B471=\"\",\"\",Konfiguration!C471)","v":""},{"$f":"IF(Konfiguration!B471=\"\",\"\",Konfiguration!D471)","v":""},null,null,null,{"$f":"IF(B481=\"\",\"\",SUMIF(Ausgaben!B:B,B481,Ausgaben!A:A))","v":""},{"$f":"IF(B481=\"\",\"\",SUMIF(Einnahmen!B:B,B481,Einnahmen!A:A))","v":""}]
[null,{"$f":"IF(Konfiguration!B472=\"\",\"\",Konfiguration!B472)","v":""},null,null,null,{"$f":"IF(Konfiguration!B472=\"\",\"\",Konfiguration!C472)","v":""},{"$f":"IF(Konfiguration!B472=\"\",\"\",Konfiguration!D472)","v":""},null,null,null,{"$f":"IF(B482=\"\",\"\",SUMIF(Ausgaben!B:B,B482,Ausgaben!A:A))","v":""},{"$f":"IF(B482=\"\",\"\",SUMIF(Einnahmen!B:B,B482,Einnahmen!A:A))","v":""}]
[null,{"$f":"IF(Konfiguration!B473=\"\",\"\",Konfiguration!B473)","v":""},null,null,null,{"$f":"IF(Konfiguration!B473=\"\",\"\",Konfiguration!C473)","v":""},{"$f":"IF(Konfiguration!B473=\"\",\"\",Konfiguration!D473)","v":""},null,null,null,{"$f":"IF(B483=\"\",\"\",SUMIF(Ausgaben!B:B,B483,Ausgaben!A:A))","v":""},{"$f":"IF(B483=\"\",\"\",SUMIF(Einnahmen!B:B,B483,Einnahmen!A:A))","v":""}]
[null,{"$f":"IF(Konfiguration!B474=\"\",\"\",Konfiguration!B474)","v":""},null,null,null,{"$f":"IF(Konfiguration!B474=\"\",\"\",Konfiguration!C474)","v":""},{"$f":"IF(Konfiguration!B474=\"\",\"\",Konfiguration!D474)","v":""},null,null,null,{"$f":"IF(B484=\"\",\"\",SUMIF(Ausgaben!B:B,B484,Ausgaben!A:A))","v":""},{"$f":"IF(B484=\"\",\"\",SUMIF(Einnahmen!B:B,B484,Einnahmen!A:A))","v":""}]
[null,{"$f":"IF(Konfiguration!B475=\"\",\"\",Konfiguration!B475)","v":""},null,null,null,{"$f":"IF(Konfiguration!B475=\"\",\"\",Konfiguration!C475)","v":""},{"$f":"IF(Konfiguration!B475=\"\",\"\",Konfiguration!D475)","v":""},null,null,null,{"$f":"IF(B485=\"\",\"\",SUMIF(Ausgaben!B:B,B485,Ausgaben!A:A))","v":""},{"$f":"IF(B485=\"\",\"\",SUMIF(Einnahmen!B:B,B485,Einnahmen!A:A))","v":""}]
[null,{"$f":"IF(Konfiguration!B476=\"\",\"\",Konfiguration!B476)","v":""},null,null,null,{"$f":"IF(Konfiguration!B476=\"\",\"\",Konfiguration!C476)","v":""},{"$f":"IF(Konfiguration!B476=\"\",\"\",Konfiguration!D476)","v":""},null,null,null,{"$f":"IF(B486=\"\",\"\",SUMIF(Ausgaben!B:B,B486,Ausgaben!A:A))","v":""},{"$f":"IF(B486=\"\",\"\",SUMIF(Einnahmen!B:B,B486,Einnahmen!A:A))","v":""}]
[null,{"$f":"IF(Konfiguration!B477=\"\",\"\",Konfiguration!B477)","v":""},null,null,null,{"$f":"IF(Konfiguration!B477=\"\",\"\",Konfiguration!C477)","v":""},{"$f":"IF(Konfiguration!B477=\"\",\"\",Konfiguration!D477)","v":""},null,null,null,{"$f":"IF(B487=\"\",\"\",SUMIF(Ausgaben!B:B,B487,Ausgaben!A:A))","v":""},{"$f":"IF(B487=\"\",\"\",SUMIF(Einnahmen!B:B,B487,Einnahmen!A:A))","v":""}]
[null,{"$f":"IF(Konfiguration!B478=\"\",\"\",Konfiguration!B478)","v":""},null,null,null,{"$f":"IF(Konfiguration!B478=\"\",\"\",Konfiguration!C478)","v":""},{"$f":"IF(Konfiguration!B478=\"\",\"\",Konfiguration!D478)","v":""},null,null,null,{"$f":"IF(B488=\"\",\"\",SUMIF(Ausgaben!B:B,B488,Ausgaben!A:A))","v":""},{"$f":"IF(B488=\"\",\"\",SUMIF(Einnahmen!B:B,B488,Einnahmen!A:A))","v":""}]
[null,{"$f":"IF(Konfiguration!B479=\"\",\"\",Konfiguration!B479)","v":""},null,null,null,{"$f":"IF(Konfiguration!B479=\"\",\"\",Konfiguration!C479)","v":""},{"$f":"IF(Konfiguration!B479=\"\",\"\",Konfiguration!D479)","v":""},null,null,null,{"$f":"IF(B489=\"\",\"\",SUMIF(Ausgaben!B:B,B489,Ausgaben!A:A))","v":""},{"$f":"IF(B489=\"\",\"\",SUMIF(Einnahmen!B:B,B489,Einnahmen!A:A))","v":""}]
[null,{"$f":"IF(Konfiguration!B480=\"\",\"\",Konfiguration!B480)","v":""},null,null,null,{"$f":"IF(Konfiguration!B480=\"\",\"\",Konfiguration!C480)","v":""},{"$f":"IF(Konfiguration!B480=\"\",\"\",Konfiguration!D480)","v":""},null,null,null,{"$f":"IF(B490=\"\",\"\",SUMIF(Ausgaben!B:B,B490,Ausgaben!A:A))","v":""},{"$f":"IF(B490=\"\",\"\",SUMIF(Einnahmen!B:B,B490,Einnahmen!A:A))","v":""}]
[null,{"$f":"IF(Konfiguration!B481=\"\",\"\",Konfiguration!B481)","v":""},null,null,null,{"$f":"IF(Konfiguration!B481=\"\",\"\",Konfiguration!C481)","v":""},{"$f":"IF(Konfiguration!B481=\"\",\"\",Konfiguration!D481)","v":""},null,null,null,{"$f":"IF(B491=\"\",\"\",SUMIF(Ausgaben!B:B,B491,Ausgaben!A:A))","v":""},{"$f":"IF(B491=\"\",\"\",SUMIF(Einnahmen!B:B,B491,Einnahmen!A:A))","v":""}]
[null,{"$f":"IF(Konfiguration!B482=\"\",\"\",Konfiguration!B482)","v":""},null,null,null,{"$f":"IF(Konfiguration!B482=\"\",\"\",Konfiguration!C482)","v":""},{"$f":"IF(Konfiguration!B482=\"\",\"\",Konfiguration!D482)","v":""},null,null,null,{"$f":"IF(B492=\"\",\"\",SUMIF(Ausgaben!B:B,B492,Ausgaben!A:A))","v":""},{"$f":"IF(B492=\"\",\"\",SUMIF(Einnahmen!B:B,B492,Einnahmen!A:A))","v":""}]
[null,{"$f":"IF(Konfiguration!B483=\"\",\"\",Konfiguration!B483)","v":""},null,null,null,{"$f":"IF(Konfiguration!B483=\"\",\"\",Konfiguration!C483)","v":""},{"$f":"IF(Konfiguration!B483=\"\",\"\",Konfiguration!D483)","v":""},null,null,null,{"$f":"IF(B493=\"\",\"\",SUMIF(Ausgaben!B:B,B493,Ausgaben!A:A))","v":""},{"$f":"IF(B493=\"\",\"\",SUMIF(Einnahmen!B:B,B493,Einnahmen!A:A))","v":""}]
[null,{"$f":"IF(Konfiguration!B484=\"\",\"\",Konfiguration!B484)","v":""},null,null,null,{"$f":"IF(Konfiguration!B484=\"\",\"\",Konfiguration!C484)","v":""},{"$f":"IF(Konfiguration!B484=\"\",\"\",Konfiguration!D484)","v":""},null,null,null,{"$f":"IF(B494=\"\",\"\",SUMIF(Ausgaben!B:B,B494,Ausgaben!A:A))","v":""},{"$f":"IF(B494=\"\",\"\",SUMIF(Einnahmen!B:B,B494,Einnahmen!A:A))","v":""}]
[null,{"$f":"IF(Konfiguration!B485=\"\",\"\",Konfiguration!B485)","v":""},null,null,null,{"$f":"IF(Konfiguration!B485=\"\",\"\",Konfiguration!C485)","v":""},{"$f":"IF(Konfiguration!B485=\"\",\"\",Konfiguration!D485)","v":""},null,null,null,{"$f":"IF(B495=\"\",\"\",SUMIF(Ausgaben!B:B,B495,Ausgaben!A:A))","v":""},{"$f":"IF(B495=\"\",\"\",SUMIF(Einnahmen!B:B,B495,Einnahmen!A:A))","v":""}]
[null,{"$f":"IF(Konfiguration!B486=\"\",\"\",Konfiguration!B486)","v":""},null,null,null,{"$f":"IF(Konfiguration!B486=\"\",\"\",Konfiguration!C486)","v":""},{"$f":"IF(Konfiguration!B486=\"\",\"\",Konfiguration!D486)","v":""},null,null,null,{"$f":"IF(B496=\"\",\"\",SUMIF(Ausgaben!B:B,B496,Ausgaben!A:A))","v":""},{"$f":"IF(B496=\"\",\"\",SUMIF(Einnahmen!B:B,B496,Einnahmen!A:A))","v":""}]
[null,{"$f":"IF(Konfiguration!B487=\"\",\"\",Konfiguration!B487)","v":""},null,null,null,{"$f":"IF(Konfiguration!B487=\"\",\"\",Konfiguration!C487)","v":""},{"$f":"IF(Konfiguration!B487=\"\",\"\",Konfiguration!D487)","v":""},null,null,null,{"$f":"IF(B497=\"\",\"\",SUMIF(Ausgaben!B:B,B497,Ausgaben!A:A))","v":""},{"$f":"IF(B497=\"\",\"\",SUMIF(Einnahmen!B:B,B497,Einnahmen!A:A))","v":""}]
[null,{"$f":"IF(Konfiguration!B488=\"\",\"\",Konfiguration!B488)","v":""},null,null,null,{"$f":"IF(Konfiguration!B488=\"\",\"\",Konfiguration!C488)","v":""},{"$f":"IF(Konfiguration!B488=\"\",\"\",Konfiguration!D488)","v":""},null,null,null,{"$f":"IF(B498=\"\",\"\",SUMIF(Ausgaben!B:B,B498,Ausgaben!A:A))","v":""},{"$f":"IF(B498=\"\",\"\",SUMIF(Einnahmen!B:B,B498,Einnahmen!A:A))","v":""}]
[null,{"$f":"IF(Konfiguration!B489=\"\",\"\",Konfiguration!B489)","v":""},null,null,null,{"$f":"IF(Konfiguration!B489=\"\",\"\",Konfiguration!C489)","v":""},{"$f":"IF(Konfiguration!B489=\"\",\"\",Konfiguration!D489)","v":""},null,null,null,{"$f":"IF(B499=\"\",\"\",SUMIF(Ausgaben!B:B,B499,Ausgaben!A:A))","v":""},{"$f":"IF(B499=\"\",\"\",SUMIF(Einnahmen!B:B,B499,Einnahmen!A:A))","v":""}]
[null,{"$f":"IF(Konfiguration!B490=\"\",\"\",Konfiguration!B490)","v":""},null,null,null,{"$f":"IF(Konfiguration!B490=\"\",\"\",Konfiguration!C490)","v":""},{"$f":"IF(Konfiguration!B490=\"\",\"\",Konfiguration!D490)","v":""},null,null,null,{"$f":"IF(B500=\"\",\"\",SUMIF(Ausgaben!B:B,B500,Ausgaben!A:A))","v":""},{"$f":"IF(B500=\"\",\"\",SUMIF(Einnahmen!B:B,B500,Einnahmen!A:A))","v":""}]
[null,{"$f":"IF(Konfiguration!B491=\"\",\"\",Konfiguration!B491)","v":""},null,null,null,{"$f":"IF(Konfiguration!B491=\"\",\"\",Konfiguration!C491)","v":""},{"$f":"IF(Konfiguration!B491=\"\",\"\",Konfiguration!D491)","v":""},null,null,null,{"$f":"IF(B501=\"\",\"\",SUMIF(Ausgaben!B:B,B501,Ausgaben!A:A))","v":""},{"$f":"IF(B501=\"\",\"\",SUMIF(Einnahmen!B:B,B501,Einnahmen!A:A))","v":""}]
[null,{"$f":"IF(Konfiguration!B492=\"\",\"\",Konfiguration!B492)","v":""},null,null,null,{"$f":"IF(Konfiguration!B492=\"\",\"\",Konfiguration!C492)","v":""},{"$f":"IF(Konfiguration!B492=\"\",\"\",Konfiguration!D492)","v":""},null,null,null,{"$f":"IF(B502=\"\",\"\",SUMIF(Ausgaben!B:B,B502,Ausgaben!A:A))","v":""},{"$f":"IF(B502=\"\",\"\",SUMIF(Einnahmen!B:B,B502,Einnahmen!A:A))","v":""}]
[null,{"$f":"IF(Konfiguration!B493=\"\",\"\",Konfiguration!B493)","v":""},null,null,null,{"$f":"IF(Konfiguration!B493=\"\",\"\",Konfiguration!C493)","v":""},{"$f":"IF(Konfiguration!B493=\"\",\"\",Konfiguration!D493)","v":""},null,null,null,{"$f":"IF(B503=\"\",\"\",SUMIF(Ausgaben!B:B,B503,Ausgaben!A:A))","v":""},{"$f":"IF(B503=\"\",\"\",SUMIF(Einnahmen!B:B,B503,Einnahmen!A:A))","v":""}]
[null,{"$f":"IF(Konfiguration!B494=\"\",\"\",Konfiguration!B494)","v":""},null,null,null,{"$f":"IF(Konfiguration!B494=\"\",\"\",Konfiguration!C494)","v":""},{"$f":"IF(Konfiguration!B494=\"\",\"\",Konfiguration!D494)","v":""},null,null,null,{"$f":"IF(B504=\"\",\"\",SUMIF(Ausgaben!B:B,B504,Ausgaben!A:A))","v":""},{"$f":"IF(B504=\"\",\"\",SUMIF(Einnahmen!B:B,B504,Einnahmen!A:A))","v":""}]
[null,{"$f":"IF(Konfiguration!B495=\"\",\"\",Konfiguration!B495)","v":""},null,null,null,{"$f":"IF(Konfiguration!B495=\"\",\"\",Konfiguration!C495)","v":""},{"$f":"IF(Konfiguration!B495=\"\",\"\",Konfiguration!D495)","v":""},null,null,null,{"$f":"IF(B505=\"\",\"\",SUMIF(Ausgaben!B:B,B505,Ausgaben!A:A))","v":""},{"$f":"IF(B505=\"\",\"\",SUMIF(Einnahmen!B:B,B505,Einnahmen!A:A))","v":""}]
[null,{"$f":"IF(Konfiguration!B496=\"\",\"\",Konfiguration!B496)","v":""},null,null,null,{"$f":"IF(Konfiguration!B496=\"\",\"\",Konfiguration!C496)","v":""},{"$f":"IF(Konfiguration!B496=\"\",\"\",Konfiguration!D496)","v":""},null,null,null,{"$f":"IF(B506=\"\",\"\",SUMIF(Ausgaben!B:B,B506,Ausgaben!A:A))","v":""},{"$f":"IF(B506=\"\",\"\",SUMIF(Einnahmen!B:B,B506,Einnahmen!A:A))","v":""}]
[null,{"$f":"IF(Konfiguration!B497=\"\",\"\",Konfiguration!B497)","v":""},null,null,null,{"$f":"IF(Konfiguration!B497=\"\",\"\",Konfiguration!C497)","v":""},{"$f":"IF(Konfiguration!B497=\"\",\"\",Konfiguration!D497)","v":""},null,null,null,{"$f":"IF(B507=\"\",\"\",SUMIF(Ausgaben!B:B,B507,Ausgaben!A:A))","v":""},{"$f":"IF(B507=\"\",\"\",SUMIF(Einnahmen!B:B,B507,Einnahmen!A:A))","v":""}]
[null,{"$f":"IF(Konfiguration!B498=\"\",\"\",Konfiguration!B498)","v":""},null,null,null,{"$f":"IF(Konfiguration!B498=\"\",\"\",Konfiguration!C498)","v":""},{"$f":"IF(Konfiguration!B498=\"\",\"\",Konfiguration!D498)","v":""},null,null,null,{"$f":"IF(B508=\"\",\"\",SUMIF(Ausgaben!B:B,B508,Ausgaben!A:A))","v":""},{"$f":"IF(B508=\"\",\"\",SUMIF(Einnahmen!B:B,B508,Einnahmen!A:A))","v":""}]
[null,{"$f":"IF(Konfiguration!B499=\"\",\"\",Konfiguration!B499)","v":""},null,null,null,{"$f":"IF(Konfiguration!B499=\"\",\"\",Konfiguration!C499)","v":""},{"$f":"IF(Konfiguration!B499=\"\",\"\",Konfiguration!D499)","v":""},null,null,null,{"$f":"IF(B509=\"\",\"\",SUMIF(Ausgaben!B:B,B509,Ausgaben!A:A))","v":""},{"$f":"IF(B509=\"\",\"\",SUMIF(Einnahmen!B:B,B509,Einnahmen!A:A))","v":""}]
[null,{"$f":"IF(Konfiguration!B500=\"\",\"\",Konfiguration!B500)","v":""},null,null,null,{"$f":"IF(Konfiguration!B500=\"\",\"\",Konfiguration!C500)","v":""},{"$f":"IF(Konfiguration!B500=\"\",\"\",Konfiguration!D500)","v":""},null,null,null,{"$f":"IF(B510=\"\",\"\",SUMIF(Ausgaben!B:B,B510,Ausgaben!A:A))","v":""},{"$f":"IF(B510=\"\",\"\",SUMIF(Einnahmen!B:B,B510,Einnahmen!A:A))","v":""}]
[null,{"$f":"IF(Konfiguration!B501=\"\",\"\",Konfiguration!B501)","v":""},null,null,null,{"$f":"IF(Konfiguration!B501=\"\",\"\",Konfiguration!C501)","v":""},{"$f":"IF(Konfiguration!B501=\"\",\"\",Konfiguration!D501)","v":""},null,null,null,{"$f":"IF(B511=\"\",\"\",SUMIF(Ausgaben!B:B,B511,Ausgaben!A:A))","v":""},{"$f":"IF(B511=\"\",\"\",SUMIF(Einnahmen!B:B,B511,Einnahmen!A:A))","v":""}]
[null,{"$f":"IF(Konfiguration!B502=\"\",\"\",Konfiguration!B502)","v":""},null,null,null,{"$f":"IF(Konfiguration!B502=\"\",\"\",Konfiguration!C502)","v":""},{"$f":"IF(Konfiguration!B502=\"\",\"\",Konfiguration!D502)","v":""},null,null,null,{"$f":"IF(B512=\"\",\"\",SUMIF(Ausgaben!B:B,B512,Ausgaben!A:A))","v":""},{"$f":"IF(B512=\"\",\"\",SUMIF(Einnahmen!B:B,B512,Einnahmen!A:A))","v":""}]
[null,{"$f":"IF(Konfiguration!B503=\"\",\"\",Konfiguration!B503)","v":""},null,null,null,{"$f":"IF(Konfiguration!B503=\"\",\"\",Konfiguration!C503)","v":""},{"$f":"IF(Konfiguration!B503=\"\",\"\",Konfiguration!D503)","v":""},null,null,null,{"$f":"IF(B513=\"\",\"\",SUMIF(Ausgaben!B:B,B513,Ausgaben!A:A))","v":""},{"$f":"IF(B513=\"\",\"\",SUMIF(Einnahmen!B:B,B513,Einnahmen!A:A))","v":""}]
[null,{"$f":"IF(Konfiguration!B504=\"\",\"\",Konfiguration!B504)","v":""},null,null,null,{"$f":"IF(Konfiguration!B504=\"\",\"\",Konfiguration!C504)","v":""},{"$f":"IF(Konfiguration!B504=\"\",\"\",Konfiguration!D504)","v":""},null,null,null,{"$f":"IF(B514=\"\",\"\",SUMIF(Ausgaben!B:B,B514,Ausgaben!A:A))","v":""},{"$f":"IF(B514=\"\",\"\",SUMIF(Einnahmen!B:B,B514,Einnahmen!A:A))","v":""}]
[null,{"$f":"IF(Konfiguration!B505=\"\",\"\",Konfiguration!B505)","v":""},null,null,null,{"$f":"IF(Konfiguration!B505=\"\",\"\",Konfiguration!C505)","v":""},{"$f":"IF(Konfiguration!B505=\"\",\"\",Konfiguration!D505)","v":""},null,null,null,{"$f":"IF(B515=\"\",\"\",SUMIF(Ausgaben!B:B,B515,Ausgaben!A:A))","v":""},{"$f":"IF(B515=\"\",\"\",SUMIF(Einnahmen!B:B,B515,Einnahmen!A:A))","v":""}]
[null,{"$f":"IF(Konfiguration!B506=\"\",\"\",Konfiguration!B506)","v":""},null,null,null,{"$f":"IF(Konfiguration!B506=\"\",\"\",Konfiguration!C506)","v":""},{"$f":"IF(Konfiguration!B506=\"\",\"\",Konfiguration!D506)","v":""},null,null,null,{"$f":"IF(B516=\"\",\"\",SUMIF(Ausgaben!B:B,B516,Ausgaben!A:A))","v":""},{"$f":"IF(B516=\"\",\"\",SUMIF(Einnahmen!B:B,B516,Einnahmen!A:A))","v":""}]
[null,{"$f":"IF(Konfiguration!B507=\"\",\"\",Konfiguration!B507)","v":""},null,null,null,{"$f":"IF(Konfiguration!B507=\"\",\"\",Konfiguration!C507)","v":""},{"$f":"IF(Konfiguration!B507=\"\",\"\",Konfiguration!D507)","v":""},null,null,null,{"$f":"IF(B517=\"\",\"\",SUMIF(Ausgaben!B:B,B517,Ausgaben!A:A))","v":""},{"$f":"IF(B517=\"\",\"\",SUMIF(Einnahmen!B:B,B517,Einnahmen!A:A))","v":""}]
[null,{"$f":"IF(Konfiguration!B508=\"\",\"\",Konfiguration!B508)","v":""},null,null,null,{"$f":"IF(Konfiguration!B508=\"\",\"\",Konfiguration!C508)","v":""},{"$f":"IF(Konfiguration!B508=\"\",\"\",Konfiguration!D508)","v":""},null,null,null,{"$f":"IF(B518=\"\",\"\",SUMIF(Ausgaben!B:B,B518,Ausgaben!A:A))","v":""},{"$f":"IF(B518=\"\",\"\",SUMIF(Einnahmen!B:B,B518,Einnahmen!A:A))","v":""}]
[null,{"$f":"IF(Konfiguration!B509=\"\",\"\",Konfiguration!B509)","v":""},null,null,null,{"$f":"IF(Konfiguration!B509=\"\",\"\",Konfiguration!C509)","v":""},{"$f":"IF(Konfiguration!B509=\"\",\"\",Konfiguration!D509)","v":""},null,null,null,{"$f":"IF(B519=\"\",\"\",SUMIF(Ausgaben!B:B,B519,Ausgaben!A:A))","v":""},{"$f":"IF(B519=\"\",\"\",SUMIF(Einnahmen!B:B,B519,Einnahmen!A:A))","v":""}]
[null,{"$f":"IF(Konfiguration!B510=\"\",\"\",Konfiguration!B510)","v":""},null,null,null,{"$f":"IF(Konfiguration!B510=\"\",\"\",Konfiguration!C510)","v":""},{"$f":"IF(Konfiguration!B510=\"\",\"\",Konfiguration!D510)","v":""},null,null,null,{"$f":"IF(B520=\"\",\"\",SUMIF(Ausgaben!B:B,B520,Ausgaben!A:A))","v":""},{"$f":"IF(B520=\"\",\"\",SUMIF(Einnahmen!B:B,B520,Einnahmen!A:A))","v":""}]
[null,{"$f":"IF(Konfiguration!B511=\"\",\"\",Konfiguration!B511)","v":""},null,null,null,{"$f":"IF(Konfiguration!B511=\"\",\"\",Konfiguration!C511)","v":""},{"$f":"IF(Konfiguration!B511=\"\",\"\",Konfiguration!D511)","v":""},null,null,null,{"$f":"IF(B521=\"\",\"\",SUMIF(Ausgaben!B:B,B521,Ausgaben!A:A))","v":""},{"$f":"IF(B521=\"\",\"\",SUMIF(Einnahmen!B:B,B521,Einnahmen!A:A))","v":""}]
[null,{"$f":"IF(Konfiguration!B512=\"\",\"\",Konfiguration!B512)","v":""},null,null,null,{"$f":"IF(Konfiguration!B512=\"\",\"\",Konfiguration!C512)","v":""},{"$f":"IF(Konfiguration!B512=\"\",\"\",Konfiguration!D512)","v":""},null,null,null,{"$f":"IF(B522=\"\",\"\",SUMIF(Ausgaben!B:B,B522,Ausgaben!A:A))","v":""},{"$f":"IF(B522=\"\",\"\",SUMIF(Einnahmen!B:B,B522,Einnahmen!A:A))","v":""}]
[null,{"$f":"IF(Konfiguration!B513=\"\",\"\",Konfiguration!B513)","v":""},null,null,null,{"$f":"IF(Konfiguration!B513=\"\",\"\",Konfiguration!C513)","v":""},{"$f":"IF(Konfiguration!B513=\"\",\"\",Konfiguration!D513)","v":""},null,null,null,{"$f":"IF(B523=\"\",\"\",SUMIF(Ausgaben!B:B,B523,Ausgaben!A:A))","v":""},{"$f":"IF(B523=\"\",\"\",SUMIF(Einnahmen!B:B,B523,Einnahmen!A:A))","v":""}]
[null,{"$f":"IF(Konfiguration!B514=\"\",\"\",Konfiguration!B514)","v":""},null,null,null,{"$f":"IF(Konfiguration!B514=\"\",\"\",Konfiguration!C514)","v":""},{"$f":"IF(Konfiguration!B514=\"\",\"\",Konfiguration!D514)","v":""},null,null,null,{"$f":"IF(B524=\"\",\"\",SUMIF(Ausgaben!B:B,B524,Ausgaben!A:A))","v":""},{"$f":"IF(B524=\"\",\"\",SUMIF(Einnahmen!B:B,B524,Einnahmen!A:A))","v":""}]
[null,{"$f":"IF(Konfiguration!B515=\"\",\"\",Konfiguration!B515)","v":""},null,null,null,{"$f":"IF(Konfiguration!B515=\"\",\"\",Konfiguration!C515)","v":""},{"$f":"IF(Konfiguration!B515=\"\",\"\",Konfiguration!D515)","v":""},null,null,null,{"$f":"IF(B525=\"\",\"\",SUMIF(Ausgaben!B:B,B525,Ausgaben!A:A))","v":""},{"$f":"IF(B525=\"\",\"\",SUMIF(Einnahmen!B:B,B525,Einnahmen!A:A))","v":""}]
[null,{"$f":"IF(Konfiguration!B516=\"\",\"\",Konfiguration!B516)","v":""},null,null,null,{"$f":"IF(Konfiguration!B516=\"\",\"\",Konfiguration!C516)","v":""},{"$f":"IF(Konfiguration!B516=\"\",\"\",Konfiguration!D516)","v":""},null,null,null,{"$f":"IF(B526=\"\",\"\",SUMIF(Ausgaben!B:B,B526,Ausgaben!A:A))","v":""},{"$f":"IF(B526=\"\",\"\",SUMIF(Einnahmen!B:B,B526,Einnahmen!A:A))","v":""}]
[null,{"$f":"IF(Konfiguration!B517=\"\",\"\",Konfiguration!B517)","v":""},null,null,null,{"$f":"IF(Konfiguration!B517=\"\",\"\",Konfiguration!C517)","v":""},{"$f":"IF(Konfiguration!B517=\"\",\"\",Konfiguration!D517)","v":""},null,null,null,{"$f":"IF(B527=\"\",\"\",SUMIF(Ausgaben!B:B,B527,Ausgaben!A:A))","v":""},{"$f":"IF(B527=\"\",\"\",SUMIF(Einnahmen!B:B,B527,Einnahmen!A:A))","v":""}]
[null,{"$f":"IF(Konfiguration!B518=\"\",\"\",Konfiguration!B518)","v":""},null,null,null,{"$f":"IF(Konfiguration!B518=\"\",\"\",Konfiguration!C518)","v":""},{"$f":"IF(Konfiguration!B518=\"\",\"\",Konfiguration!D518)","v":""},null,null,null,{"$f":"IF(B528=\"\",\"\",SUMIF(Ausgaben!B:B,B528,Ausgaben!A:A))","v":""},{"$f":"IF(B528=\"\",\"\",SUMIF(Einnahmen!B:B,B528,Einnahmen!A:A))","v":""}]
[null,{"$f":"IF(Konfiguration!B519=\"\",\"\",Konfiguration!B519)","v":""},null,null,null,{"$f":"IF(Konfiguration!B519=\"\",\"\",Konfiguration!C519)","v":""},{"$f":"IF(Konfiguration!B519=\"\",\"\",Konfiguration!D519)","v":""},null,null,null,{"$f":"IF(B529=\"\",\"\",SUMIF(Ausgaben!B:B,B529,Ausgaben!A:A))","v":""},{"$f":"IF(B529=\"\",\"\",SUMIF(Einnahmen!B:B,B529,Einnahmen!A:A))","v":""}]
[null,{"$f":"IF(Konfiguration!B520=\"\",\"\",Konfiguration!B520)","v":""},null,null,null,{"$f":"IF(Konfiguration!B520=\"\",\"\",Konfiguration!C520)","v":""},{"$f":"IF(Konfiguration!B520=\"\",\"\",Konfiguration!D520)","v":""},null,null,null,{"$f":"IF(B530=\"\",\"\",SUMIF(Ausgaben!B:B,B530,Ausgaben!A:A))","v":""},{"$f":"IF(B530=\"\",\"\",SUMIF(Einnahmen!B:B,B530,Einnahmen!A:A))","v":""}]
[null,{"$f":"IF(Konfiguration!B521=\"\",\"\",Konfiguration!B521)","v":""},null,null,null,{"$f":"IF(Konfiguration!B521=\"\",\"\",Konfiguration!C521)","v":""},{"$f":"IF(Konfiguration!B521=\"\",\"\",Konfiguration!D521)","v":""},null,null,null,{"$f":"IF(B531=\"\",\"\",SUMIF(Ausgaben!B:B,B531,Ausgaben!A:A))","v":""},{"$f":"IF(B531=\"\",\"\",SUMIF(Einnahmen!B:B,B531,Einnahmen!A:A))","v":""}]
[null,{"$f":"IF(Konfiguration!B522=\"\",\"\",Konfiguration!B522)","v":""},null,null,null,{"$f":"IF(Konfiguration!B522=\"\",\"\",Konfiguration!C522)","v":""},{"$f":"IF(Konfiguration!B522=\"\",\"\",Konfiguration!D522)","v":""},null,null,null,{"$f":"IF(B532=\"\",\"\",SUMIF(Ausgaben!B:B,B532,Ausgaben!A:A))","v":""},{"$f":"IF(B532=\"\",\"\",SUMIF(Einnahmen!B:B,B532,Einnahmen!A:A))","v":""}]
[null,{"$f":"IF(Konfiguration!B523=\"\",\"\",Konfiguration!B523)","v":""},null,null,null,{"$f":"IF(Konfiguration!B523=\"\",\"\",Konfiguration!C523)","v":""},{"$f":"IF(Konfiguration!B523=\"\",\"\",Konfiguration!D523)","v":""},null,null,null,{"$f":"IF(B533=\"\",\"\",SUMIF(Ausgaben!B:B,B533,Ausgaben!A:A))","v":""},{"$f":"IF(B533=\"\",\"\",SUMIF(Einnahmen!B:B,B533,Einnahmen!A:A))","v":""}]
[null,{"$f":"IF(Konfiguration!B524=\"\",\"\",Konfiguration!B524)","v":""},null,null,null,{"$f":"IF(Konfiguration!B524=\"\",\"\",Konfiguration!C524)","v":""},{"$f":"IF(Konfiguration!B524=\"\",\"\",Konfiguration!D524)","v":""},null,null,null,{"$f":"IF(B534=\"\",\"\",SUMIF(Ausgaben!B:B,B534,Ausgaben!A:A))","v":""},{"$f":"IF(B534=\"\",\"\",SUMIF(Einnahmen!B:B,B534,Einnahmen!A:A))","v":""}]
[null,{"$f":"IF(Konfiguration!B525=\"\",\"\",Konfiguration!B525)","v":""},null,null,null,{"$f":"IF(Konfiguration!B525=\"\",\"\",Konfiguration!C525)","v":""},{"$f":"IF(Konfiguration!B525=\"\",\"\",Konfiguration!D525)","v":""},null,null,null,{"$f":"IF(B535=\"\",\"\",SUMIF(Ausgaben!B:B,B535,Ausgaben!A:A))","v":""},{"$f":"IF(B535=\"\",\"\",SUMIF(Einnahmen!B:B,B535,Einnahmen!A:A))","v":""}]
[null,{"$f":"IF(Konfiguration!B526=\"\",\"\",Konfiguration!B526)","v":""},null,null,null,{"$f":"IF(Konfiguration!B526=\"\",\"\",Konfiguration!C526)","v":""},{"$f":"IF(Konfiguration!B526=\"\",\"\",Konfiguration!D526)","v":""},null,null,null,{"$f":"IF(B536=\"\",\"\",SUMIF(Ausgaben!B:B,B536,Ausgaben!A:A))","v":""},{"$f":"IF(B536=\"\",\"\",SUMIF(Einnahmen!B:B,B536,Einnahmen!A:A))","v":""}]
[null,{"$f":"IF(Konfiguration!B527=\"\",\"\",Konfiguration!B527)","v":""},null,null,null,{"$f":"IF(Konfiguration!B527=\"\",\"\",Konfiguration!C527)","v":""},{"$f":"IF(Konfiguration!B527=\"\",\"\",Konfiguration!D527)","v":""},null,null,null,{"$f":"IF(B537=\"\",\"\",SUMIF(Ausgaben!B:B,B537,Ausgaben!A:A))","v":""},{"$f":"IF(B537=\"\",\"\",SUMIF(Einnahmen!B:B,B537,Einnahmen!A:A))","v":""}]
[null,{"$f":"IF(Konfiguration!B528=\"\",\"\",Konfiguration!B528)","v":""},null,null,null,{"$f":"IF(Konfiguration!B528=\"\",\"\",Konfiguration!C528)","v":""},{"$f":"IF(Konfiguration!B528=\"\",\"\",Konfiguration!D528)","v":""},null,null,null,{"$f":"IF(B538=\"\",\"\",SUMIF(Ausgaben!B:B,B538,Ausgaben!A:A))","v":""},{"$f":"IF(B538=\"\",\"\",SUMIF(Einnahmen!B:B,B538,Einnahmen!A:A))","v":""}]
[null,{"$f":"IF(Konfiguration!B529=\"\",\"\",Konfiguration!B529)","v":""},null,null,null,{"$f":"IF(Konfiguration!B529=\"\",\"\",Konfiguration!C529)","v":""},{"$f":"IF(Konfiguration!B529=\"\",\"\",Konfiguration!D529)","v":""},null,null,null,{"$f":"IF(B539=\"\",\"\",SUMIF(Ausgaben!B:B,B539,Ausgaben!A:A))","v":""},{"$f":"IF(B539=\"\",\"\",SUMIF(Einnahmen!B:B,B539,Einnahmen!A:A))","v":""}]
[null,{"$f":"IF(Konfiguration!B530=\"\",\"\",Konfiguration!B530)","v":""},null,null,null,{"$f":"IF(Konfiguration!B530=\"\",\"\",Konfiguration!C530)","v":""},{"$f":"IF(Konfiguration!B530=\"\",\"\",Konfiguration!D530)","v":""},null,null,null,{"$f":"IF(B540=\"\",\"\",SUMIF(Ausgaben!B:B,B540,Ausgaben!A:A))","v":""},{"$f":"IF(B540=\"\",\"\",SUMIF(Einnahmen!B:B,B540,Einnahmen!A:A))","v":""}]
[null,{"$f":"IF(Konfiguration!B531=\"\",\"\",Konfiguration!B531)","v":""},null,null,null,{"$f":"IF(Konfiguration!B531=\"\",\"\",Konfiguration!C531)","v":""},{"$f":"IF(Konfiguration!B531=\"\",\"\",Konfiguration!D531)","v":""},null,null,null,{"$f":"IF(B541=\"\",\"\",SUMIF(Ausgaben!B:B,B541,Ausgaben!A:A))","v":""},{"$f":"IF(B541=\"\",\"\",SUMIF(Einnahmen!B:B,B541,Einnahmen!A:A))","v":""}]
[null,{"$f":"IF(Konfiguration!B532=\"\",\"\",Konfiguration!B532)","v":""},null,null,null,{"$f":"IF(Konfiguration!B532=\"\",\"\",Konfiguration!C532)","v":""},{"$f":"IF(Konfiguration!B532=\"\",\"\",Konfiguration!D532)","v":""},null,null,null,{"$f":"IF(B542=\"\",\"\",SUMIF(Ausgaben!B:B,B542,Ausgaben!A:A))","v":""},{"$f":"IF(B542=\"\",\"\",SUMIF(Einnahmen!B:B,B542,Einnahmen!A:A))","v":""}]
[null,{"$f":"IF(Konfiguration!B533=\"\",\"\",Konfiguration!B533)","v":""},null,null,null,{"$f":"IF(Konfiguration!B533=\"\",\"\",Konfiguration!C533)","v":""},{"$f":"IF(Konfiguration!B533=\"\",\"\",Konfiguration!D533)","v":""},null,null,null,{"$f":"IF(B543=\"\",\"\",SUMIF(Ausgaben!B:B,B543,Ausgaben!A:A))","v":""},{"$f":"IF(B543=\"\",\"\",SUMIF(Einnahmen!B:B,B543,Einnahmen!A:A))","v":""}]
[null,{"$f":"IF(Konfiguration!B534=\"\",\"\",Konfiguration!B534)","v":""},null,null,null,{"$f":"IF(Konfiguration!B534=\"\",\"\",Konfiguration!C534)","v":""},{"$f":"IF(Konfiguration!B534=\"\",\"\",Konfiguration!D534)","v":""},null,null,null,{"$f":"IF(B544=\"\",\"\",SUMIF(Ausgaben!B:B,B544,Ausgaben!A:A))","v":""},{"$f":"IF(B544=\"\",\"\",SUMIF(Einnahmen!B:B,B544,Einnahmen!A:A))","v":""}]
[null,{"$f":"IF(Konfiguration!B535=\"\",\"\",Konfiguration!B535)","v":""},null,null,null,{"$f":"IF(Konfiguration!B535=\"\",\"\",Konfiguration!C535)","v":""},{"$f":"IF(Konfiguration!B535=\"\",\"\",Konfiguration!D535)","v":""},null,null,null,{"$f":"IF(B545=\"\",\"\",SUMIF(Ausgaben!B:B,B545,Ausgaben!A:A))","v":""},{"$f":"IF(B545=\"\",\"\",SUMIF(Einnahmen!B:B,B545,Einnahmen!A:A))","v":""}]
[null,{"$f":"IF(Konfiguration!B536=\"\",\"\",Konfiguration!B536)","v":""},null,null,null,{"$f":"IF(Konfiguration!B536=\"\",\"\",Konfiguration!C536)","v":""},{"$f":"IF(Konfiguration!B536=\"\",\"\",Konfiguration!D536)","v":""},null,null,null,{"$f":"IF(B546=\"\",\"\",SUMIF(Ausgaben!B:B,B546,Ausgaben!A:A))","v":""},{"$f":"IF(B546=\"\",\"\",SUMIF(Einnahmen!B:B,B546,Einnahmen!A:A))","v":""}]
[null,{"$f":"IF(Konfiguration!B537=\"\",\"\",Konfiguration!B537)","v":""},null,null,null,{"$f":"IF(Konfiguration!B537=\"\",\"\",Konfiguration!C537)","v":""},{"$f":"IF(Konfiguration!B537=\"\",\"\",Konfiguration!D537)","v":""},null,null,null,{"$f":"IF(B547=\"\",\"\",SUMIF(Ausgaben!B:B,B547,Ausgaben!A:A))","v":""},{"$f":"IF(B547=\"\",\"\",SUMIF(Einnahmen!B:B,B547,Einnahmen!A:A))","v":""}]
[null,{"$f":"IF(Konfiguration!B538=\"\",\"\",Konfiguration!B538)","v":""},null,null,null,{"$f":"IF(Konfiguration!B538=\"\",\"\",Konfiguration!C538)","v":""},{"$f":"IF(Konfiguration!B538=\"\",\"\",Konfiguration!D538)","v":""},null,null,null,{"$f":"IF(B548=\"\",\"\",SUMIF(Ausgaben!B:B,B548,Ausgaben!A:A))","v":""},{"$f":"IF(B548=\"\",\"\",SUMIF(Einnahmen!B:B,B548,Einnahmen!A:A))","v":""}]
[null,{"$f":"IF(Konfiguration!B539=\"\",\"\",Konfiguration!B539)","v":""},null,null,null,{"$f":"IF(Konfiguration!B539=\"\",\"\",Konfiguration!C539)","v":""},{"$f":"IF(Konfiguration!B539=\"\",\"\",Konfiguration!D539)","v":""},null,null,null,{"$f":"IF(B549=\"\",\"\",SUMIF(Ausgaben!B:B,B549,Ausgaben!A:A))","v":""},{"$f":"IF(B549=\"\",\"\",SUMIF(Einnahmen!B:B,B549,Einnahmen!A:A))","v":""}]
[null,{"$f":"IF(Konfiguration!B540=\"\",\"\",Konfiguration!B540)","v":""},null,null,null,{"$f":"IF(Konfiguration!B540=\"\",\"\",Konfiguration!C540)","v":""},{"$f":"IF(Konfiguration!B540=\"\",\"\",Konfiguration!D540)","v":""},null,null,null,{"$f":"IF(B550=\"\",\"\",SUMIF(Ausgaben!B:B,B550,Ausgaben!A:A))","v":""},{"$f":"IF(B550=\"\",\"\",SUMIF(Einnahmen!B:B,B550,Einnahmen!A:A))","v":""}]
[null,{"$f":"IF(Konfiguration!B541=\"\",\"\",Konfiguration!B541)","v":""},null,null,null,{"$f":"IF(Konfiguration!B541=\"\",\"\",Konfiguration!C541)","v":""},{"$f":"IF(Konfiguration!B541=\"\",\"\",Konfiguration!D541)","v":""},null,null,null,{"$f":"IF(B551=\"\",\"\",SUMIF(Ausgaben!B:B,B551,Ausgaben!A:A))","v":""},{"$f":"IF(B551=\"\",\"\",SUMIF(Einnahmen!B:B,B551,Einnahmen!A:A))","v":""}]
[null,{"$f":"IF(Konfiguration!B542=\"\",\"\",Konfiguration!B542)","v":""},null,null,null,{"$f":"IF(Konfiguration!B542=\"\",\"\",Konfiguration!C542)","v":""},{"$f":"IF(Konfiguration!B542=\"\",\"\",Konfiguration!D542)","v":""},null,null,null,{"$f":"IF(B552=\"\",\"\",SUMIF(Ausgaben!B:B,B552,Ausgaben!A:A))","v":""},{"$f":"IF(B552=\"\",\"\",SUMIF(Einnahmen!B:B,B552,Einnahmen!A:A))","v":""}]
[null,{"$f":"IF(Konfiguration!B543=\"\",\"\",Konfiguration!B543)","v":""},null,null,null,{"$f":"IF(Konfiguration!B543=\"\",\"\",Konfiguration!C543)","v":""},{"$f":"IF(Konfiguration!B543=\"\",\"\",Konfiguration!D543)","v":""},null,null,null,{"$f":"IF(B553=\"\",\"\",SUMIF(Ausgaben!B:B,B553,Ausgaben!A:A))","v":""},{"$f":"IF(B553=\"\",\"\",SUMIF(Einnahmen!B:B,B553,Einnahmen!A:A))","v":""}]
[null,{"$f":"IF(Konfiguration!B544=\"\",\"\",Konfiguration!B544)","v":""},null,null,null,{"$f":"IF(Konfiguration!B544=\"\",\"\",Konfiguration!C544)","v":""},{"$f":"IF(Konfiguration!B544=\"\",\"\",Konfiguration!D544)","v":""},null,null,null,{"$f":"IF(B554=\"\",\"\",SUMIF(Ausgaben!B:B,B554,Ausgaben!A:A))","v":""},{"$f":"IF(B554=\"\",\"\",SUMIF(Einnahmen!B:B,B554,Einnahmen!A:A))","v":""}]
[null,{"$f":"IF(Konfiguration!B545=\"\",\"\",Konfiguration!B545)","v":""},null,null,null,{"$f":"IF(Konfiguration!B545=\"\",\"\",Konfiguration!C545)","v":""},{"$f":"IF(Konfiguration!B545=\"\",\"\",Konfiguration!D545)","v":""},null,null,null,{"$f":"IF(B555=\"\",\"\",SUMIF(Ausgaben!B:B,B555,Ausgaben!A:A))","v":""},{"$f":"IF(B555=\"\",\"\",SUMIF(Einnahmen!B:B,B555,Einnahmen!A:A))","v":""}]
[null,{"$f":"IF(Konfiguration!B546=\"\",\"\",Konfiguration!B546)","v":""},null,null,null,{"$f":"IF(Konfiguration!B546=\"\",\"\",Konfiguration!C546)","v":""},{"$f":"IF(Konfiguration!B546=\"\",\"\",Konfiguration!D546)","v":""},null,null,null,{"$f":"IF(B556=\"\",\"\",SUMIF(Ausgaben!B:B,B556,Ausgaben!A:A))","v":""},{"$f":"IF(B556=\"\",\"\",SUMIF(Einnahmen!B:B,B556,Einnahmen!A:A))","v":""}]
[null,{"$f":"IF(Konfiguration!B547=\"\",\"\",Konfiguration!B547)","v":""},null,null,null,{"$f":"IF(Konfiguration!B547=\"\",\"\",Konfiguration!C547)","v":""},{"$f":"IF(Konfiguration!B547=\"\",\"\",Konfiguration!D547)","v":""},null,null,null,{"$f":"IF(B557=\"\",\"\",SUMIF(Ausgaben!B:B,B557,Ausgaben!A:A))","v":""},{"$f":"IF(B557=\"\",\"\",SUMIF(Einnahmen!B:B,B557,Einnahmen!A:A))","v":""}]
[null,{"$f":"IF(Konfiguration!B548=\"\",\"\",Konfiguration!B548)","v":""},null,null,null,{"$f":"IF(Konfiguration!B548=\"\",\"\",Konfiguration!C548)","v":""},{"$f":"IF(Konfiguration!B548=\"\",\"\",Konfiguration!D548)","v":""},null,null,null,{"$f":"IF(B558=\"\",\"\",SUMIF(Ausgaben!B:B,B558,Ausgaben!A:A))","v":""},{"$f":"IF(B558=\"\",\"\",SUMIF(Einnahmen!B:B,B558,Einnahmen!A:A))","v":""}]
[null,{"$f":"IF(Konfiguration!B549=\"\",\"\",Konfiguration!B549)","v":""},null,null,null,{"$f":"IF(Konfiguration!B549=\"\",\"\",Konfiguration!C549)","v":""},{"$f":"IF(Konfiguration!B549=\"\",\"\",Konfiguration!D549)","v":""},null,null,null,{"$f":"IF(B559=\"\",\"\",SUMIF(Ausgaben!B:B,B559,Ausgaben!A:A))","v":""},{"$f":"IF(B559=\"\",\"\",SUMIF(Einnahmen!B:B,B559,Einnahmen!A:A))","v":""}]
[null,{"$f":"IF(Konfiguration!B550=\"\",\"\",Konfiguration!B550)","v":""},null,null,null,{"$f":"IF(Konfiguration!B550=\"\",\"\",Konfiguration!C550)","v":""},{"$f":"IF(Konfiguration!B550=\"\",\"\",Konfiguration!D550)","v":""},null,null,null,{"$f":"IF(B560=\"\",\"\",SUMIF(Ausgaben!B:B,B560,Ausgaben!A:A))","v":""},{"$f":"IF(B560=\"\",\"\",SUMIF(Einnahmen!B:B,B560,Einnahmen!A:A))","v":""}]
[null,{"$f":"IF(Konfiguration!B551=\"\",\"\",Konfiguration!B551)","v":""},null,null,null,{"$f":"IF(Konfiguration!B551=\"\",\"\",Konfiguration!C551)","v":""},{"$f":"IF(Konfiguration!B551=\"\",\"\",Konfiguration!D551)","v":""},null,null,null,{"$f":"IF(B561=\"\",\"\",SUMIF(Ausgaben!B:B,B561,Ausgaben!A:A))","v":""},{"$f":"IF(B561=\"\",\"\",SUMIF(Einnahmen!B:B,B561,Einnahmen!A:A))","v":""}]
[null,{"$f":"IF(Konfiguration!B552=\"\",\"\",Konfiguration!B552)","v":""},null,null,null,{"$f":"IF(Konfiguration!B552=\"\",\"\",Konfiguration!C552)","v":""},{"$f":"IF(Konfiguration!B552=\"\",\"\",Konfiguration!D552)","v":""},null,null,null,{"$f":"IF(B562=\"\",\"\",SUMIF(Ausgaben!B:B,B562,Ausgaben!A:A))","v":""},{"$f":"IF(B562=\"\",\"\",SUMIF(Einnahmen!B:B,B562,Einnahmen!A:A))","v":""}]
[null,{"$f":"IF(Konfiguration!B553=\"\",\"\",Konfiguration!B553)","v":""},null,null,null,{"$f":"IF(Konfiguration!B553=\"\",\"\",Konfiguration!C553)","v":""},{"$f":"IF(Konfiguration!B553=\"\",\"\",Konfiguration!D553)","v":""},null,null,null,{"$f":"IF(B563=\"\",\"\",SUMIF(Ausgaben!B:B,B563,Ausgaben!A:A))","v":""},{"$f":"IF(B563=\"\",\"\",SUMIF(Einnahmen!B:B,B563,Einnahmen!A:A))","v":""}]
[null,{"$f":"IF(Konfiguration!B554=\"\",\"\",Konfiguration!B554)","v":""},null,null,null,{"$f":"IF(Konfiguration!B554=\"\",\"\",Konfiguration!C554)","v":""},{"$f":"IF(Konfiguration!B554=\"\",\"\",Konfiguration!D554)","v":""},null,null,null,{"$f":"IF(B564=\"\",\"\",SUMIF(Ausgaben!B:B,B564,Ausgaben!A:A))","v":""},{"$f":"IF(B564=\"\",\"\",SUMIF(Einnahmen!B:B,B564,Einnahmen!A:A))","v":""}]
[null,{"$f":"IF(Konfiguration!B555=\"\",\"\",Konfiguration!B555)","v":""},null,null,null,{"$f":"IF(Konfiguration!B555=\"\",\"\",Konfiguration!C555)","v":""},{"$f":"IF(Konfiguration!B555=\"\",\"\",Konfiguration!D555)","v":""},null,null,null,{"$f":"IF(B565=\"\",\"\",SUMIF(Ausgaben!B:B,B565,Ausgaben!A:A))","v":""},{"$f":"IF(B565=\"\",\"\",SUMIF(Einnahmen!B:B,B565,Einnahmen!A:A))","v":""}]
[null,{"$f":"IF(Konfiguration!B556=\"\",\"\",Konfiguration!B556)","v":""},null,null,null,{"$f":"IF(Konfiguration!B556=\"\",\"\",Konfiguration!C556)","v":""},{"$f":"IF(Konfiguration!B556=\"\",\"\",Konfiguration!D556)","v":""},null,null,null,{"$f":"IF(B566=\"\",\"\",SUMIF(Ausgaben!B:B,B566,Ausgaben!A:A))","v":""},{"$f":"IF(B566=\"\",\"\",SUMIF(Einnahmen!B:B,B566,Einnahmen!A:A))","v":""}]
[null,{"$f":"IF(Konfiguration!B557=\"\",\"\",Konfiguration!B557)","v":""},null,null,null,{"$f":"IF(Konfiguration!B557=\"\",\"\",Konfiguration!C557)","v":""},{"$f":"IF(Konfiguration!B557=\"\",\"\",Konfiguration!D557)","v":""},null,null,null,{"$f":"IF(B567=\"\",\"\",SUMIF(Ausgaben!B:B,B567,Ausgaben!A:A))","v":""},{"$f":"IF(B567=\"\",\"\",SUMIF(Einnahmen!B:B,B567,Einnahmen!A:A))","v":""}]
[null,{"$f":"IF(Konfiguration!B558=\"\",\"\",Konfiguration!B558)","v":""},null,null,null,{"$f":"IF(Konfiguration!B558=\"\",\"\",Konfiguration!C558)","v":""},{"$f":"IF(Konfiguration!B558=\"\",\"\",Konfiguration!D558)","v":""},null,null,null,{"$f":"IF(B568=\"\",\"\",SUMIF(Ausgaben!B:B,B568,Ausgaben!A:A))","v":""},{"$f":"IF(B568=\"\",\"\",SUMIF(Einnahmen!B:B,B568,Einnahmen!A:A))","v":""}]
[null,{"$f":"IF(Konfiguration!B559=\"\",\"\",Konfiguration!B559)","v":""},null,null,null,{"$f":"IF(Konfiguration!B559=\"\",\"\",Konfiguration!C559)","v":""},{"$f":"IF(Konfiguration!B559=\"\",\"\",Konfiguration!D559)","v":""},null,null,null,{"$f":"IF(B569=\"\",\"\",SUMIF(Ausgaben!B:B,B569,Ausgaben!A:A))","v":""},{"$f":"IF(B569=\"\",\"\",SUMIF(Einnahmen!B:B,B569,Einnahmen!A:A))","v":""}]
[null,{"$f":"IF(Konfiguration!B560=\"\",\"\",Konfiguration!B560)","v":""},null,null,null,{"$f":"IF(Konfiguration!B560=\"\",\"\",Konfiguration!C560)","v":""},{"$f":"IF(Konfiguration!B560=\"\",\"\",Konfiguration!D560)","v":""},null,null,null,{"$f":"IF(B570=\"\",\"\",SUMIF(Ausgaben!B:B,B570,Ausgaben!A:A))","v":""},{"$f":"IF(B570=\"\",\"\",SUMIF(Einnahmen!B:B,B570,Einnahmen!A:A))","v":""}]
[null,{"$f":"IF(Konfiguration!B561=\"\",\"\",Konfiguration!B561)","v":""},null,null,null,{"$f":"IF(Konfiguration!B561=\"\",\"\",Konfiguration!C561)","v":""},{"$f":"IF(Konfiguration!B561=\"\",\"\",Konfiguration!D561)","v":""},null,null,null,{"$f":"IF(B571=\"\",\"\",SUMIF(Ausgaben!B:B,B571,Ausgaben!A:A))","v":""},{"$f":"IF(B571=\"\",\"\",SUMIF(Einnahmen!B:B,B571,Einnahmen!A:A))","v":""}]
[null,{"$f":"IF(Konfiguration!B562=\"\",\"\",Konfiguration!B562)","v":""},null,null,null,{"$f":"IF(Konfiguration!B562=\"\",\"\",Konfiguration!C562)","v":""},{"$f":"IF(Konfiguration!B562=\"\",\"\",Konfiguration!D562)","v":""},null,null,null,{"$f":"IF(B572=\"\",\"\",SUMIF(Ausgaben!B:B,B572,Ausgaben!A:A))","v":""},{"$f":"IF(B572=\"\",\"\",SUMIF(Einnahmen!B:B,B572,Einnahmen!A:A))","v":""}]
[null,{"$f":"IF(Konfiguration!B563=\"\",\"\",Konfiguration!B563)","v":""},null,null,null,{"$f":"IF(Konfiguration!B563=\"\",\"\",Konfiguration!C563)","v":""},{"$f":"IF(Konfiguration!B563=\"\",\"\",Konfiguration!D563)","v":""},null,null,null,{"$f":"IF(B573=\"\",\"\",SUMIF(Ausgaben!B:B,B573,Ausgaben!A:A))","v":""},{"$f":"IF(B573=\"\",\"\",SUMIF(Einnahmen!B:B,B573,Einnahmen!A:A))","v":""}]
[null,{"$f":"IF(Konfiguration!B564=\"\",\"\",Konfiguration!B564)","v":""},null,null,null,{"$f":"IF(Konfiguration!B564=\"\",\"\",Konfiguration!C564)","v":""},{"$f":"IF(Konfiguration!B564=\"\",\"\",Konfiguration!D564)","v":""},null,null,null,{"$f":"IF(B574=\"\",\"\",SUMIF(Ausgaben!B:B,B574,Ausgaben!A:A))","v":""},{"$f":"IF(B574=\"\",\"\",SUMIF(Einnahmen!B:B,B574,Einnahmen!A:A))","v":""}]
[null,{"$f":"IF(Konfiguration!B565=\"\",\"\",Konfiguration!B565)","v":""},null,null,null,{"$f":"IF(Konfiguration!B565=\"\",\"\",Konfiguration!C565)","v":""},{"$f":"IF(Konfiguration!B565=\"\",\"\",Konfiguration!D565)","v":""},null,null,null,{"$f":"IF(B575=\"\",\"\",SUMIF(Ausgaben!B:B,B575,Ausgaben!A:A))","v":""},{"$f":"IF(B575=\"\",\"\",SUMIF(Einnahmen!B:B,B575,Einnahmen!A:A))","v":""}]
[null,{"$f":"IF(Konfiguration!B566=\"\",\"\",Konfiguration!B566)","v":""},null,null,null,{"$f":"IF(Konfiguration!B566=\"\",\"\",Konfiguration!C566)","v":""},{"$f":"IF(Konfiguration!B566=\"\",\"\",Konfiguration!D566)","v":""},null,null,null,{"$f":"IF(B576=\"\",\"\",SUMIF(Ausgaben!B:B,B576,Ausgaben!A:A))","v":""},{"$f":"IF(B576=\"\",\"\",SUMIF(Einnahmen!B:B,B576,Einnahmen!A:A))","v":""}]
[null,{"$f":"IF(Konfiguration!B567=\"\",\"\",Konfiguration!B567)","v":""},null,null,null,{"$f":"IF(Konfiguration!B567=\"\",\"\",Konfiguration!C567)","v":""},{"$f":"IF(Konfiguration!B567=\"\",\"\",Konfiguration!D567)","v":""},null,null,null,{"$f":"IF(B577=\"\",\"\",SUMIF(Ausgaben!B:B,B577,Ausgaben!A:A))","v":""},{"$f":"IF(B577=\"\",\"\",SUMIF(Einnahmen!B:B,B577,Einnahmen!A:A))","v":""}]
[null,{"$f":"IF(Konfiguration!B568=\"\",\"\",Konfiguration!B568)","v":""},null,null,null,{"$f":"IF(Konfiguration!B568=\"\",\"\",Konfiguration!C568)","v":""},{"$f":"IF(Konfiguration!B568=\"\",\"\",Konfiguration!D568)","v":""},null,null,null,{"$f":"IF(B578=\"\",\"\",SUMIF(Ausgaben!B:B,B578,Ausgaben!A:A))","v":""},{"$f":"IF(B578=\"\",\"\",SUMIF(Einnahmen!B:B,B578,Einnahmen!A:A))","v":""}]
[null,{"$f":"IF(Konfiguration!B569=\"\",\"\",Konfiguration!B569)","v":""},null,null,null,{"$f":"IF(Konfiguration!B569=\"\",\"\",Konfiguration!C569)","v":""},{"$f":"IF(Konfiguration!B569=\"\",\"\",Konfiguration!D569)","v":""},null,null,null,{"$f":"IF(B579=\"\",\"\",SUMIF(Ausgaben!B:B,B579,Ausgaben!A:A))","v":""},{"$f":"IF(B579=\"\",\"\",SUMIF(Einnahmen!B:B,B579,Einnahmen!A:A))","v":""}]
[null,{"$f":"IF(Konfiguration!B570=\"\",\"\",Konfiguration!B570)","v":""},null,null,null,{"$f":"IF(Konfiguration!B570=\"\",\"\",Konfiguration!C570)","v":""},{"$f":"IF(Konfiguration!B570=\"\",\"\",Konfiguration!D570)","v":""},null,null,null,{"$f":"IF(B580=\"\",\"\",SUMIF(Ausgaben!B:B,B580,Ausgaben!A:A))","v":""},{"$f":"IF(B580=\"\",\"\",SUMIF(Einnahmen!B:B,B580,Einnahmen!A:A))","v":""}]
[null,{"$f":"IF(Konfiguration!B571=\"\",\"\",Konfiguration!B571)","v":""},null,null,null,{"$f":"IF(Konfiguration!B571=\"\",\"\",Konfiguration!C571)","v":""},{"$f":"IF(Konfiguration!B571=\"\",\"\",Konfiguration!D571)","v":""},null,null,null,{"$f":"IF(B581=\"\",\"\",SUMIF(Ausgaben!B:B,B581,Ausgaben!A:A))","v":""},{"$f":"IF(B581=\"\",\"\",SUMIF(Einnahmen!B:B,B581,Einnahmen!A:A))","v":""}]
[null,{"$f":"IF(Konfiguration!B572=\"\",\"\",Konfiguration!B572)","v":""},null,null,null,{"$f":"IF(Konfiguration!B572=\"\",\"\",Konfiguration!C572)","v":""},{"$f":"IF(Konfiguration!B572=\"\",\"\",Konfiguration!D572)","v":""},null,null,null,{"$f":"IF(B582=\"\",\"\",SUMIF(Ausgaben!B:B,B582,Ausgaben!A:A))","v":""},{"$f":"IF(B582=\"\",\"\",SUMIF(Einnahmen!B:B,B582,Einnahmen!A:A))","v":""}]
[null,{"$f":"IF(Konfiguration!B573=\"\",\"\",Konfiguration!B573)","v":""},null,null,null,{"$f":"IF(Konfiguration!B573=\"\",\"\",Konfiguration!C573)","v":""},{"$f":"IF(Konfiguration!B573=\"\",\"\",Konfiguration!D573)","v":""},null,null,null,{"$f":"IF(B583=\"\",\"\",SUMIF(Ausgaben!B:B,B583,Ausgaben!A:A))","v":""},{"$f":"IF(B583=\"\",\"\",SUMIF(Einnahmen!B:B,B583,Einnahmen!A:A))","v":""}]
[null,{"$f":"IF(Konfiguration!B574=\"\",\"\",Konfiguration!B574)","v":""},null,null,null,{"$f":"IF(Konfiguration!B574=\"\",\"\",Konfiguration!C574)","v":""},{"$f":"IF(Konfiguration!B574=\"\",\"\",Konfiguration!D574)","v":""},null,null,null,{"$f":"IF(B584=\"\",\"\",SUMIF(Ausgaben!B:B,B584,Ausgaben!A:A))","v":""},{"$f":"IF(B584=\"\",\"\",SUMIF(Einnahmen!B:B,B584,Einnahmen!A:A))","v":""}]
[null,{"$f":"IF(Konfiguration!B575=\"\",\"\",Konfiguration!B575)","v":""},null,null,null,{"$f":"IF(Konfiguration!B575=\"\",\"\",Konfiguration!C575)","v":""},{"$f":"IF(Konfiguration!B575=\"\",\"\",Konfiguration!D575)","v":""},null,null,null,{"$f":"IF(B585=\"\",\"\",SUMIF(Ausgaben!B:B,B585,Ausgaben!A:A))","v":""},{"$f":"IF(B585=\"\",\"\",SUMIF(Einnahmen!B:B,B585,Einnahmen!A:A))","v":""}]
[null,{"$f":"IF(Konfiguration!B576=\"\",\"\",Konfiguration!B576)","v":""},null,null,null,{"$f":"IF(Konfiguration!B576=\"\",\"\",Konfiguration!C576)","v":""},{"$f":"IF(Konfiguration!B576=\"\",\"\",Konfiguration!D576)","v":""},null,null,null,{"$f":"IF(B586=\"\",\"\",SUMIF(Ausgaben!B:B,B586,Ausgaben!A:A))","v":""},{"$f":"IF(B586=\"\",\"\",SUMIF(Einnahmen!B:B,B586,Einnahmen!A:A))","v":""}]
[null,{"$f":"IF(Konfiguration!B577=\"\",\"\",Konfiguration!B577)","v":""},null,null,null,{"$f":"IF(Konfiguration!B577=\"\",\"\",Konfiguration!C577)","v":""},{"$f":"IF(Konfiguration!B577=\"\",\"\",Konfiguration!D577)","v":""},null,null,null,{"$f":"IF(B587=\"\",\"\",SUMIF(Ausgaben!B:B,B587,Ausgaben!A:A))","v":""},{"$f":"IF(B587=\"\",\"\",SUMIF(Einnahmen!B:B,B587,Einnahmen!A:A))","v":""}]
[null,{"$f":"IF(Konfiguration!B578=\"\",\"\",Konfiguration!B578)","v":""},null,null,null,{"$f":"IF(Konfiguration!B578=\"\",\"\",Konfiguration!C578)","v":""},{"$f":"IF(Konfiguration!B578=\"\",\"\",Konfiguration!D578)","v":""},null,null,null,{"$f":"IF(B588=\"\",\"\",SUMIF(Ausgaben!B:B,B588,Ausgaben!A:A))","v":""},{"$f":"IF(B588=\"\",\"\",SUMIF(Einnahmen!B:B,B588,Einnahmen!A:A))","v":""}]
[null,{"$f":"IF(Konfiguration!B579=\"\",\"\",Konfiguration!B579)","v":""},null,null,null,{"$f":"IF(Konfiguration!B579=\"\",\"\",Konfiguration!C579)","v":""},{"$f":"IF(Konfiguration!B579=\"\",\"\",Konfiguration!D579)","v":""},null,null,null,{"$f":"IF(B589=\"\",\"\",SUMIF(Ausgaben!B:B,B589,Ausgaben!A:A))","v":""},{"$f":"IF(B589=\"\",\"\",SUMIF(Einnahmen!B:B,B589,Einnahmen!A:A))","v":""}]
[null,{"$f":"IF(Konfiguration!B580=\"\",\"\",Konfiguration!B580)","v":""},null,null,null,{"$f":"IF(Konfiguration!B580=\"\",\"\",Konfiguration!C580)","v":""},{"$f":"IF(Konfiguration!B580=\"\",\"\",Konfiguration!D580)","v":""},null,null,null,{"$f":"IF(B590=\"\",\"\",SUMIF(Ausgaben!B:B,B590,Ausgaben!A:A))","v":""},{"$f":"IF(B590=\"\",\"\",SUMIF(Einnahmen!B:B,B590,Einnahmen!A:A))","v":""}]
[null,{"$f":"IF(Konfiguration!B581=\"\",\"\",Konfiguration!B581)","v":""},null,null,null,{"$f":"IF(Konfiguration!B581=\"\",\"\",Konfiguration!C581)","v":""},{"$f":"IF(Konfiguration!B581=\"\",\"\",Konfiguration!D581)","v":""},null,null,null,{"$f":"IF(B591=\"\",\"\",SUMIF(Ausgaben!B:B,B591,Ausgaben!A:A))","v":""},{"$f":"IF(B591=\"\",\"\",SUMIF(Einnahmen!B:B,B591,Einnahmen!A:A))","v":""}]
[null,{"$f":"IF(Konfiguration!B582=\"\",\"\",Konfiguration!B582)","v":""},null,null,null,{"$f":"IF(Konfiguration!B582=\"\",\"\",Konfiguration!C582)","v":""},{"$f":"IF(Konfiguration!B582=\"\",\"\",Konfiguration!D582)","v":""},null,null,null,{"$f":"IF(B592=\"\",\"\",SUMIF(Ausgaben!B:B,B592,Ausgaben!A:A))","v":""},{"$f":"IF(B592=\"\",\"\",SUMIF(Einnahmen!B:B,B592,Einnahmen!A:A))","v":""}]
[null,{"$f":"IF(Konfiguration!B583=\"\",\"\",Konfiguration!B583)","v":""},null,null,null,{"$f":"IF(Konfiguration!B583=\"\",\"\",Konfiguration!C583)","v":""},{"$f":"IF(Konfiguration!B583=\"\",\"\",Konfiguration!D583)","v":""},null,null,null,{"$f":"IF(B593=\"\",\"\",SUMIF(Ausgaben!B:B,B593,Ausgaben!A:A))","v":""},{"$f":"IF(B593=\"\",\"\",SUMIF(Einnahmen!B:B,B593,Einnahmen!A:A))","v":""}]
[null,{"$f":"IF(Konfiguration!B584=\"\",\"\",Konfiguration!B584)","v":""},null,null,null,{"$f":"IF(Konfiguration!B584=\"\",\"\",Konfiguration!C584)","v":""},{"$f":"IF(Konfiguration!B584=\"\",\"\",Konfiguration!D584)","v":""},null,null,null,{"$f":"IF(B594=\"\",\"\",SUMIF(Ausgaben!B:B,B594,Ausgaben!A:A))","v":""},{"$f":"IF(B594=\"\",\"\",SUMIF(Einnahmen!B:B,B594,Einnahmen!A:A))","v":""}]
[null,{"$f":"IF(Konfiguration!B585=\"\",\"\",Konfiguration!B585)","v":""},null,null,null,{"$f":"IF(Konfiguration!B585=\"\",\"\",Konfiguration!C585)","v":""},{"$f":"IF(Konfiguration!B585=\"\",\"\",Konfiguration!D585)","v":""},null,null,null,{"$f":"IF(B595=\"\",\"\",SUMIF(Ausgaben!B:B,B595,Ausgaben!A:A))","v":""},{"$f":"IF(B595=\"\",\"\",SUMIF(Einnahmen!B:B,B595,Einnahmen!A:A))","v":""}]
[null,{"$f":"IF(Konfiguration!B586=\"\",\"\",Konfiguration!B586)","v":""},null,null,null,{"$f":"IF(Konfiguration!B586=\"\",\"\",Konfiguration!C586)","v":""},{"$f":"IF(Konfiguration!B586=\"\",\"\",Konfiguration!D586)","v":""},null,null,null,{"$f":"IF(B596=\"\",\"\",SUMIF(Ausgaben!B:B,B596,Ausgaben!A:A))","v":""},{"$f":"IF(B596=\"\",\"\",SUMIF(Einnahmen!B:B,B596,Einnahmen!A:A))","v":""}]
[null,{"$f":"IF(Konfiguration!B587=\"\",\"\",Konfiguration!B587)","v":""},null,null,null,{"$f":"IF(Konfiguration!B587=\"\",\"\",Konfiguration!C587)","v":""},{"$f":"IF(Konfiguration!B587=\"\",\"\",Konfiguration!D587)","v":""},null,null,null,{"$f":"IF(B597=\"\",\"\",SUMIF(Ausgaben!B:B,B597,Ausgaben!A:A))","v":""},{"$f":"IF(B597=\"\",\"\",SUMIF(Einnahmen!B:B,B597,Einnahmen!A:A))","v":""}]
[null,{"$f":"IF(Konfiguration!B588=\"\",\"\",Konfiguration!B588)","v":""},null,null,null,{"$f":"IF(Konfiguration!B588=\"\",\"\",Konfiguration!C588)","v":""},{"$f":"IF(Konfiguration!B588=\"\",\"\",Konfiguration!D588)","v":""},null,null,null,{"$f":"IF(B598=\"\",\"\",SUMIF(Ausgaben!B:B,B598,Ausgaben!A:A))","v":""},{"$f":"IF(B598=\"\",\"\",SUMIF(Einnahmen!B:B,B598,Einnahmen!A:A))","v":""}]
[null,{"$f":"IF(Konfiguration!B589=\"\",\"\",Konfiguration!B589)","v":""},null,null,null,{"$f":"IF(Konfiguration!B589=\"\",\"\",Konfiguration!C589)","v":""},{"$f":"IF(Konfiguration!B589=\"\",\"\",Konfiguration!D589)","v":""},null,null,null,{"$f":"IF(B599=\"\",\"\",SUMIF(Ausgaben!B:B,B599,Ausgaben!A:A))","v":""},{"$f":"IF(B599=\"\",\"\",SUMIF(Einnahmen!B:B,B599,Einnahmen!A:A))","v":""}]
[null,{"$f":"IF(Konfiguration!B590=\"\",\"\",Konfiguration!B590)","v":""},null,null,null,{"$f":"IF(Konfiguration!B590=\"\",\"\",Konfiguration!C590)","v":""},{"$f":"IF(Konfiguration!B590=\"\",\"\",Konfiguration!D590)","v":""},null,null,null,{"$f":"IF(B600=\"\",\"\",SUMIF(Ausgaben!B:B,B600,Ausgaben!A:A))","v":""},{"$f":"IF(B600=\"\",\"\",SUMIF(Einnahmen!B:B,B600,Einnahmen!A:A))","v":""}]
[null,{"$f":"IF(Konfiguration!B591=\"\",\"\",Konfiguration!B591)","v":""},null,null,null,{"$f":"IF(Konfiguration!B591=\"\",\"\",Konfiguration!C591)","v":""},{"$f":"IF(Konfiguration!B591=\"\",\"\",Konfiguration!D591)","v":""},null,null,null,{"$f":"IF(B601=\"\",\"\",SUMIF(Ausgaben!B:B,B601,Ausgaben!A:A))","v":""},{"$f":"IF(B601=\"\",\"\",SUMIF(Einnahmen!B:B,B601,Einnahmen!A:A))","v":""}]
[null,{"$f":"IF(Konfiguration!B592=\"\",\"\",Konfiguration!B592)","v":""},null,null,null,{"$f":"IF(Konfiguration!B592=\"\",\"\",Konfiguration!C592)","v":""},{"$f":"IF(Konfiguration!B592=\"\",\"\",Konfiguration!D592)","v":""},null,null,null,{"$f":"IF(B602=\"\",\"\",SUMIF(Ausgaben!B:B,B602,Ausgaben!A:A))","v":""},{"$f":"IF(B602=\"\",\"\",SUMIF(Einnahmen!B:B,B602,Einnahmen!A:A))","v":""}]
[null,{"$f":"IF(Konfiguration!B593=\"\",\"\",Konfiguration!B593)","v":""},null,null,null,{"$f":"IF(Konfiguration!B593=\"\",\"\",Konfiguration!C593)","v":""},{"$f":"IF(Konfiguration!B593=\"\",\"\",Konfiguration!D593)","v":""},null,null,null,{"$f":"IF(B603=\"\",\"\",SUMIF(Ausgaben!B:B,B603,Ausgaben!A:A))","v":""},{"$f":"IF(B603=\"\",\"\",SUMIF(Einnahmen!B:B,B603,Einnahmen!A:A))","v":""}]
[null,{"$f":"IF(Konfiguration!B594=\"\",\"\",Konfiguration!B594)","v":""},null,null,null,{"$f":"IF(Konfiguration!B594=\"\",\"\",Konfiguration!C594)","v":""},{"$f":"IF(Konfiguration!B594=\"\",\"\",Konfiguration!D594)","v":""},null,null,null,{"$f":"IF(B604=\"\",\"\",SUMIF(Ausgaben!B:B,B604,Ausgaben!A:A))","v":""},{"$f":"IF(B604=\"\",\"\",SUMIF(Einnahmen!B:B,B604,Einnahmen!A:A))","v":""}]
[null,{"$f":"IF(Konfiguration!B595=\"\",\"\",Konfiguration!B595)","v":""},null,null,null,{"$f":"IF(Konfiguration!B595=\"\",\"\",Konfiguration!C595)","v":""},{"$f":"IF(Konfiguration!B595=\"\",\"\",Konfiguration!D595)","v":""},null,null,null,{"$f":"IF(B605=\"\",\"\",SUMIF(Ausgaben!B:B,B605,Ausgaben!A:A))","v":""},{"$f":"IF(B605=\"\",\"\",SUMIF(Einnahmen!B:B,B605,Einnahmen!A:A))","v":""}]
[null,{"$f":"IF(Konfiguration!B596=\"\",\"\",Konfiguration!B596)","v":""},null,null,null,{"$f":"IF(Konfiguration!B596=\"\",\"\",Konfiguration!C596)","v":""},{"$f":"IF(Konfiguration!B596=\"\",\"\",Konfiguration!D596)","v":""},null,null,null,{"$f":"IF(B606=\"\",\"\",SUMIF(Ausgaben!B:B,B606,Ausgaben!A:A))","v":""},{"$f":"IF(B606=\"\",\"\",SUMIF(Einnahmen!B:B,B606,Einnahmen!A:A))","v":""}]
[null,{"$f":"IF(Konfiguration!B597=\"\",\"\",Konfiguration!B597)","v":""},null,null,null,{"$f":"IF(Konfiguration!B597=\"\",\"\",Konfiguration!C597)","v":""},{"$f":"IF(Konfiguration!B597=\"\",\"\",Konfiguration!D597)","v":""},null,null,null,{"$f":"IF(B607=\"\",\"\",SUMIF(Ausgaben!B:B,B607,Ausgaben!A:A))","v":""},{"$f":"IF(B607=\"\",\"\",SUMIF(Einnahmen!B:B,B607,Einnahmen!A:A))","v":""}]
[null,{"$f":"IF(Konfiguration!B599=\"\",\"\",Konfiguration!B599)","v":""},null,null,null,{"$f":"IF(Konfiguration!B598=\"\",\"\",Konfiguration!C598)","v":""},{"$f":"IF(Konfiguration!B598=\"\",\"\",Konfiguration!D598)","v":""},null,null,null,{"$f":"IF(B608=\"\",\"\",SUMIF(Ausgaben!B:B,B608,Ausgaben!A:A))","v":""},{"$f":"IF(B608=\"\",\"\",SUMIF(Einnahmen!B:B,B608,Einnahmen!A:A))","v":""}]
[null,{"$f":"IF(Konfiguration!B600=\"\",\"\",Konfiguration!B600)","v":""},null,null,null,{"$f":"IF(Konfiguration!B599=\"\",\"\",Konfiguration!C599)","v":""},{"$f":"IF(Konfiguration!B599=\"\",\"\",Konfiguration!D599)","v":""},null,null,null,{"$f":"IF(B609=\"\",\"\",SUMIF(Ausgaben!B:B,B609,Ausgaben!A:A))","v":""},{"$f":"IF(B609=\"\",\"\",SUMIF(Einnahmen!B:B,B609,Einnahmen!A:A))","v":""}]
[null,{"$f":"IF(Konfiguration!B601=\"\",\"\",Konfiguration!B601)","v":""},null,null,null,{"$f":"IF(Konfiguration!B600=\"\",\"\",Konfiguration!C600)","v":""},{"$f":"IF(Konfiguration!B600=\"\",\"\",Konfiguration!D600)","v":""},null,null,null,{"$f":"IF(B610=\"\",\"\",SUMIF(Ausgaben!B:B,B610,Ausgaben!A:A))","v":""},{"$f":"IF(B610=\"\",\"\",SUMIF(Einnahmen!B:B,B610,Einnahmen!A:A))","v":""}]
[null,{"$f":"IF(Konfiguration!B602=\"\",\"\",Konfiguration!B602)","v":""},null,null,null,{"$f":"IF(Konfiguration!B601=\"\",\"\",Konfiguration!C601)","v":""},{"$f":"IF(Konfiguration!B601=\"\",\"\",Konfiguration!D601)","v":""},null,null,null,{"$f":"IF(B611=\"\",\"\",SUMIF(Ausgaben!B:B,B611,Ausgaben!A:A))","v":""},{"$f":"IF(B611=\"\",\"\",SUMIF(Einnahmen!B:B,B611,Einnahmen!A:A))","v":""}]
[null,{"$f":"IF(Konfiguration!B603=\"\",\"\",Konfiguration!B603)","v":""},null,null,null,{"$f":"IF(Konfiguration!B602=\"\",\"\",Konfiguration!C602)","v":""},{"$f":"IF(Konfiguration!B602=\"\",\"\",Konfiguration!D602)","v":""},null,null,null,{"$f":"IF(B612=\"\",\"\",SUMIF(Ausgaben!B:B,B612,Ausgaben!A:A))","v":""},{"$f":"IF(B612=\"\",\"\",SUMIF(Einnahmen!B:B,B612,Einnahmen!A:A))","v":""}]
[null,{"$f":"IF(Konfiguration!B604=\"\",\"\",Konfiguration!B604)","v":""},null,null,null,{"$f":"IF(Konfiguration!B603=\"\",\"\",Konfiguration!C603)","v":""},{"$f":"IF(Konfiguration!B603=\"\",\"\",Konfiguration!D603)","v":""},null,null,null,{"$f":"IF(B613=\"\",\"\",SUMIF(Ausgaben!B:B,B613,Ausgaben!A:A))","v":""},{"$f":"IF(B613=\"\",\"\",SUMIF(Einnahmen!B:B,B613,Einnahmen!A:A))","v":""}]
[null,{"$f":"IF(Konfiguration!B605=\"\",\"\",Konfiguration!B605)","v":""},null,null,null,{"$f":"IF(Konfiguration!B604=\"\",\"\",Konfiguration!C604)","v":""},{"$f":"IF(Konfiguration!B604=\"\",\"\",Konfiguration!D604)","v":""},null,null,null,{"$f":"IF(B614=\"\",\"\",SUMIF(Ausgaben!B:B,B614,Ausgaben!A:A))","v":""},{"$f":"IF(B614=\"\",\"\",SUMIF(Einnahmen!B:B,B614,Einnahmen!A:A))","v":""}]
[null,{"$f":"IF(Konfiguration!B606=\"\",\"\",Konfiguration!B606)","v":""},null,null,null,{"$f":"IF(Konfiguration!B605=\"\",\"\",Konfiguration!C605)","v":""},{"$f":"IF(Konfiguration!B605=\"\",\"\",Konfiguration!D605)","v":""},null,null,null,{"$f":"IF(B615=\"\",\"\",SUMIF(Ausgaben!B:B,B615,Ausgaben!A:A))","v":""},{"$f":"IF(B615=\"\",\"\",SUMIF(Einnahmen!B:B,B615,Einnahmen!A:A))","v":""}]
[null,{"$f":"IF(Konfiguration!B607=\"\",\"\",Konfiguration!B607)","v":""},null,null,null,{"$f":"IF(Konfiguration!B606=\"\",\"\",Konfiguration!C606)","v":""},{"$f":"IF(Konfiguration!B606=\"\",\"\",Konfiguration!D606)","v":""},null,null,null,{"$f":"IF(B616=\"\",\"\",SUMIF(Ausgaben!B:B,B616,Ausgaben!A:A))","v":""},{"$f":"IF(B616=\"\",\"\",SUMIF(Einnahmen!B:B,B616,Einnahmen!A:A))","v":""}]
[null,{"$f":"IF(Konfiguration!B608=\"\",\"\",Konfiguration!B608)","v":""},null,null,null,{"$f":"IF(Konfiguration!B607=\"\",\"\",Konfiguration!C607)","v":""},{"$f":"IF(Konfiguration!B607=\"\",\"\",Konfiguration!D607)","v":""},null,null,null,{"$f":"IF(B617=\"\",\"\",SUMIF(Ausgaben!B:B,B617,Ausgaben!A:A))","v":""},{"$f":"IF(B617=\"\",\"\",SUMIF(Einnahmen!B:B,B617,Einnahmen!A:A))","v":""}]
[null,{"$f":"IF(Konfiguration!B609=\"\",\"\",Konfiguration!B609)","v":""},null,null,null,{"$f":"IF(Konfiguration!B608=\"\",\"\",Konfiguration!C608)","v":""},{"$f":"IF(Konfiguration!B608=\"\",\"\",Konfiguration!D608)","v":""},null,null,null,{"$f":"IF(B618=\"\",\"\",SUMIF(Ausgaben!B:B,B618,Ausgaben!A:A))","v":""},{"$f":"IF(B618=\"\",\"\",SUMIF(Einnahmen!B:B,B618,Einnahmen!A:A))","v":""}]
[null,{"$f":"IF(Konfiguration!B610=\"\",\"\",Konfiguration!B610)","v":""},null,null,null,{"$f":"IF(Konfiguration!B609=\"\",\"\",Konfiguration!C609)","v":""},{"$f":"IF(Konfiguration!B609=\"\",\"\",Konfiguration!D609)","v":""},null,null,null,{"$f":"IF(B619=\"\",\"\",SUMIF(Ausgaben!B:B,B619,Ausgaben!A:A))","v":""},{"$f":"IF(B619=\"\",\"\",SUMIF(Einnahmen!B:B,B619,Einnahmen!A:A))","v":""}]
[null,{"$f":"IF(Konfiguration!B611=\"\",\"\",Konfiguration!B611)","v":""},null,null,null,{"$f":"IF(Konfiguration!B610=\"\",\"\",Konfiguration!C610)","v":""},{"$f":"IF(Konfiguration!B610=\"\",\"\",Konfiguration!D610)","v":""},null,null,null,{"$f":"IF(B620=\"\",\"\",SUMIF(Ausgaben!B:B,B620,Ausgaben!A:A))","v":""},{"$f":"IF(B620=\"\",\"\",SUMIF(Einnahmen!B:B,B620,Einnahmen!A:A))","v":""}]
[null,{"$f":"IF(Konfiguration!B612=\"\",\"\",Konfiguration!B612)","v":""},null,null,null,{"$f":"IF(Konfiguration!B611=\"\",\"\",Konfiguration!C611)","v":""},{"$f":"IF(Konfiguration!B611=\"\",\"\",Konfiguration!D611)","v":""},null,null,null,{"$f":"IF(B621=\"\",\"\",SUMIF(Ausgaben!B:B,B621,Ausgaben!A:A))","v":""},{"$f":"IF(B621=\"\",\"\",SUMIF(Einnahmen!B:B,B621,Einnahmen!A:A))","v":""}]
[null,{"$f":"IF(Konfiguration!B613=\"\",\"\",Konfiguration!B613)","v":""},null,null,null,{"$f":"IF(Konfiguration!B612=\"\",\"\",Konfiguration!C612)","v":""},{"$f":"IF(Konfiguration!B612=\"\",\"\",Konfiguration!D612)","v":""},null,null,null,{"$f":"IF(B622=\"\",\"\",SUMIF(Ausgaben!B:B,B622,Ausgaben!A:A))","v":""},{"$f":"IF(B622=\"\",\"\",SUMIF(Einnahmen!B:B,B622,Einnahmen!A:A))","v":""}]
[null,{"$f":"IF(Konfiguration!B614=\"\",\"\",Konfiguration!B614)","v":""},null,null,null,{"$f":"IF(Konfiguration!B613=\"\",\"\",Konfiguration!C613)","v":""},{"$f":"IF(Konfiguration!B613=\"\",\"\",Konfiguration!D613)","v":""},null,null,null,{"$f":"IF(B623=\"\",\"\",SUMIF(Ausgaben!B:B,B623,Ausgaben!A:A))","v":""},{"$f":"IF(B623=\"\",\"\",SUMIF(Einnahmen!B:B,B623,Einnahmen!A:A))","v":""}]
[null,{"$f":"IF(Konfiguration!B615=\"\",\"\",Konfiguration!B615)","v":""},null,null,null,{"$f":"IF(Konfiguration!B614=\"\",\"\",Konfiguration!C614)","v":""},{"$f":"IF(Konfiguration!B614=\"\",\"\",Konfiguration!D614)","v":""},null,null,null,{"$f":"IF(B624=\"\",\"\",SUMIF(Ausgaben!B:B,B624,Ausgaben!A:A))","v":""},{"$f":"IF(B624=\"\",\"\",SUMIF(Einnahmen!B:B,B624,Einnahmen!A:A))","v":""}]
[null,{"$f":"IF(Konfiguration!B616=\"\",\"\",Konfiguration!B616)","v":""},null,null,null,{"$f":"IF(Konfiguration!B615=\"\",\"\",Konfiguration!C615)","v":""},{"$f":"IF(Konfiguration!B615=\"\",\"\",Konfiguration!D615)","v":""},null,null,null,{"$f":"IF(B625=\"\",\"\",SUMIF(Ausgaben!B:B,B625,Ausgaben!A:A))","v":""},{"$f":"IF(B625=\"\",\"\",SUMIF(Einnahmen!B:B,B625,Einnahmen!A:A))","v":""}]
[null,{"$f":"IF(Konfiguration!B617=\"\",\"\",Konfiguration!B617)","v":""},null,null,null,{"$f":"IF(Konfiguration!B616=\"\",\"\",Konfiguration!C616)","v":""},{"$f":"IF(Konfiguration!B616=\"\",\"\",Konfiguration!D616)","v":""},null,null,null,{"$f":"IF(B626=\"\",\"\",SUMIF(Ausgaben!B:B,B626,Ausgaben!A:A))","v":""},{"$f":"IF(B626=\"\",\"\",SUMIF(Einnahmen!B:B,B626,Einnahmen!A:A))","v":""}]
[null,{"$f":"IF(Konfiguration!B618=\"\",\"\",Konfiguration!B618)","v":""},null,null,null,{"$f":"IF(Konfiguration!B617=\"\",\"\",Konfiguration!C617)","v":""},{"$f":"IF(Konfiguration!B617=\"\",\"\",Konfiguration!D617)","v":""},null,null,null,{"$f":"IF(B627=\"\",\"\",SUMIF(Ausgaben!B:B,B627,Ausgaben!A:A))","v":""},{"$f":"IF(B627=\"\",\"\",SUMIF(Einnahmen!B:B,B627,Einnahmen!A:A))","v":""}]
[null,{"$f":"IF(Konfiguration!B619=\"\",\"\",Konfiguration!B619)","v":""},null,null,null,{"$f":"IF(Konfiguration!B618=\"\",\"\",Konfiguration!C618)","v":""},{"$f":"IF(Konfiguration!B618=\"\",\"\",Konfiguration!D618)","v":""},null,null,null,{"$f":"IF(B628=\"\",\"\",SUMIF(Ausgaben!B:B,B628,Ausgaben!A:A))","v":""},{"$f":"IF(B628=\"\",\"\",SUMIF(Einnahmen!B:B,B628,Einnahmen!A:A))","v":""}]
[null,{"$f":"IF(Konfiguration!B620=\"\",\"\",Konfiguration!B620)","v":""},null,null,null,{"$f":"IF(Konfiguration!B619=\"\",\"\",Konfiguration!C619)","v":""},{"$f":"IF(Konfiguration!B619=\"\",\"\",Konfiguration!D619)","v":""},null,null,null,{"$f":"IF(B629=\"\",\"\",SUMIF(Ausgaben!B:B,B629,Ausgaben!A:A))","v":""},{"$f":"IF(B629=\"\",\"\",SUMIF(Einnahmen!B:B,B629,Einnahmen!A:A))","v":""}]
[null,{"$f":"IF(Konfiguration!B621=\"\",\"\",Konfiguration!B621)","v":""},null,null,null,{"$f":"IF(Konfiguration!B620=\"\",\"\",Konfiguration!C620)","v":""},{"$f":"IF(Konfiguration!B620=\"\",\"\",Konfiguration!D620)","v":""},null,null,null,{"$f":"IF(B630=\"\",\"\",SUMIF(Ausgaben!B:B,B630,Ausgaben!A:A))","v":""},{"$f":"IF(B630=\"\",\"\",SUMIF(Einnahmen!B:B,B630,Einnahmen!A:A))","v":""}]
[null,{"$f":"IF(Konfiguration!B622=\"\",\"\",Konfiguration!B622)","v":""},null,null,null,{"$f":"IF(Konfiguration!B621=\"\",\"\",Konfiguration!C621)","v":""},{"$f":"IF(Konfiguration!B621=\"\",\"\",Konfiguration!D621)","v":""},null,null,null,{"$f":"IF(B631=\"\",\"\",SUMIF(Ausgaben!B:B,B631,Ausgaben!A:A))","v":""},{"$f":"IF(B631=\"\",\"\",SUMIF(Einnahmen!B:B,B631,Einnahmen!A:A))","v":""}]
[null,{"$f":"IF(Konfiguration!B623=\"\",\"\",Konfiguration!B623)","v":""},null,null,null,{"$f":"IF(Konfiguration!B622=\"\",\"\",Konfiguration!C622)","v":""},{"$f":"IF(Konfiguration!B622=\"\",\"\",Konfiguration!D622)","v":""},null,null,null,{"$f":"IF(B632=\"\",\"\",SUMIF(Ausgaben!B:B,B632,Ausgaben!A:A))","v":""},{"$f":"IF(B632=\"\",\"\",SUMIF(Einnahmen!B:B,B632,Einnahmen!A:A))","v":""}]
[null,{"$f":"IF(Konfiguration!B624=\"\",\"\",Konfiguration!B624)","v":""},null,null,null,{"$f":"IF(Konfiguration!B623=\"\",\"\",Konfiguration!C623)","v":""},{"$f":"IF(Konfiguration!B623=\"\",\"\",Konfiguration!D623)","v":""},null,null,null,{"$f":"IF(B633=\"\",\"\",SUMIF(Ausgaben!B:B,B633,Ausgaben!A:A))","v":""},{"$f":"IF(B633=\"\",\"\",SUMIF(Einnahmen!B:B,B633,Einnahmen!A:A))","v":""}]
[null,{"$f":"IF(Konfiguration!B625=\"\",\"\",Konfiguration!B625)","v":""},null,null,null,{"$f":"IF(Konfiguration!B625=\"\",\"\",Konfiguration!C625)","v":""},{"$f":"IF(Konfiguration!B624=\"\",\"\",Konfiguration!D624)","v":""},null,null,null,{"$f":"IF(B634=\"\",\"\",SUMIF(Ausgaben!B:B,B634,Ausgaben!A:A))","v":""},{"$f":"IF(B634=\"\",\"\",SUMIF(Einnahmen!B:B,B634,Einnahmen!A:A))","v":""}]
[null,{"$f":"IF(Konfiguration!B626=\"\",\"\",Konfiguration!B626)","v":""},null,null,null,{"$f":"IF(Konfiguration!B626=\"\",\"\",Konfiguration!C626)","v":""},{"$f":"IF(Konfiguration!B625=\"\",\"\",Konfiguration!D625)","v":""},null,null,null,{"$f":"IF(B635=\"\",\"\",SUMIF(Ausgaben!B:B,B635,Ausgaben!A:A))","v":""},{"$f":"IF(B635=\"\",\"\",SUMIF(Einnahmen!B:B,B635,Einnahmen!A:A))","v":""}]
[null,{"$f":"IF(Konfiguration!B627=\"\",\"\",Konfiguration!B627)","v":""},null,null,null,{"$f":"IF(Konfiguration!B627=\"\",\"\",Konfiguration!C627)","v":""},{"$f":"IF(Konfiguration!B626=\"\",\"\",Konfiguration!D626)","v":""},null,null,null,{"$f":"IF(B636=\"\",\"\",SUMIF(Ausgaben!B:B,B636,Ausgaben!A:A))","v":""},{"$f":"IF(B636=\"\",\"\",SUMIF(Einnahmen!B:B,B636,Einnahmen!A:A))","v":""}]
[null,{"$f":"IF(Konfiguration!B628=\"\",\"\",Konfiguration!B628)","v":""},null,null,null,{"$f":"IF(Konfiguration!B628=\"\",\"\",Konfiguration!C628)","v":""},{"$f":"IF(Konfiguration!B627=\"\",\"\",Konfiguration!D627)","v":""},null,null,null,{"$f":"IF(B637=\"\",\"\",SUMIF(Ausgaben!B:B,B637,Ausgaben!A:A))","v":""},{"$f":"IF(B637=\"\",\"\",SUMIF(Einnahmen!B:B,B637,Einnahmen!A:A))","v":""}]
[null,{"$f":"IF(Konfiguration!B629=\"\",\"\",Konfiguration!B629)","v":""},null,null,null,{"$f":"IF(Konfiguration!B629=\"\",\"\",Konfiguration!C629)","v":""},{"$f":"IF(Konfiguration!B628=\"\",\"\",Konfiguration!D628)","v":""},null,null,null,{"$f":"IF(B638=\"\",\"\",SUMIF(Ausgaben!B:B,B638,Ausgaben!A:A))","v":""},{"$f":"IF(B638=\"\",\"\",SUMIF(Einnahmen!B:B,B638,Einnahmen!A:A))","v":""}]
[null,{"$f":"IF(Konfiguration!B630=\"\",\"\",Konfiguration!B630)","v":""},null,null,null,{"$f":"IF(Konfiguration!B630=\"\",\"\",Konfiguration!C630)","v":""},{"$f":"IF(Konfiguration!B629=\"\",\"\",Konfiguration!D629)","v":""},null,null,null,{"$f":"IF(B639=\"\",\"\",SUMIF(Ausgaben!B:B,B639,Ausgaben!A:A))","v":""},{"$f":"IF(B639=\"\",\"\",SUMIF(Einnahmen!B:B,B639,Einnahmen!A:A))","v":""}]
[null,{"$f":"IF(Konfiguration!B631=\"\",\"\",Konfiguration!B631)","v":""},null,null,null,{"$f":"IF(Konfiguration!B631=\"\",\"\",Konfiguration!C631)","v":""},{"$f":"IF(Konfiguration!B630=\"\",\"\",Konfiguration!D630)","v":""},null,null,null,{"$f":"IF(B640=\"\",\"\",SUMIF(Ausgaben!B:B,B640,Ausgaben!A:A))","v":""},{"$f":"IF(B640=\"\",\"\",SUMIF(Einnahmen!B:B,B640,Einnahmen!A:A))","v":""}]
[null,{"$f":"IF(Konfiguration!B632=\"\",\"\",Konfiguration!B632)","v":""},null,null,null,{"$f":"IF(Konfiguration!B632=\"\",\"\",Konfiguration!C632)","v":""},{"$f":"IF(Konfiguration!B631=\"\",\"\",Konfiguration!D631)","v":""},null,null,null,{"$f":"IF(B641=\"\",\"\",SUMIF(Ausgaben!B:B,B641,Ausgaben!A:A))","v":""},{"$f":"IF(B641=\"\",\"\",SUMIF(Einnahmen!B:B,B641,Einnahmen!A:A))","v":""}]
[null,{"$f":"IF(Konfiguration!B633=\"\",\"\",Konfiguration!B633)","v":""},null,null,null,{"$f":"IF(Konfiguration!B633=\"\",\"\",Konfiguration!C633)","v":""},{"$f":"IF(Konfiguration!B632=\"\",\"\",Konfiguration!D632)","v":""},null,null,null,{"$f":"IF(B642=\"\",\"\",SUMIF(Ausgaben!B:B,B642,Ausgaben!A:A))","v":""},{"$f":"IF(B642=\"\",\"\",SUMIF(Einnahmen!B:B,B642,Einnahmen!A:A))","v":""}]
[null,{"$f":"IF(Konfiguration!B634=\"\",\"\",Konfiguration!B634)","v":""},null,null,null,{"$f":"IF(Konfiguration!B634=\"\",\"\",Konfiguration!C634)","v":""},{"$f":"IF(Konfiguration!B633=\"\",\"\",Konfiguration!D633)","v":""},null,null,null,{"$f":"IF(B643=\"\",\"\",SUMIF(Ausgaben!B:B,B643,Ausgaben!A:A))","v":""},{"$f":"IF(B643=\"\",\"\",SUMIF(Einnahmen!B:B,B643,Einnahmen!A:A))","v":""}]
[null,{"$f":"IF(Konfiguration!B635=\"\",\"\",Konfiguration!B635)","v":""},null,null,null,{"$f":"IF(Konfiguration!B635=\"\",\"\",Konfiguration!C635)","v":""},{"$f":"IF(Konfiguration!B634=\"\",\"\",Konfiguration!D634)","v":""},null,null,null,{"$f":"IF(B644=\"\",\"\",SUMIF(Ausgaben!B:B,B644,Ausgaben!A:A))","v":""},{"$f":"IF(B644=\"\",\"\",SUMIF(Einnahmen!B:B,B644,Einnahmen!A:A))","v":""}]
[null,{"$f":"IF(Konfiguration!B636=\"\",\"\",Konfiguration!B636)","v":""},null,null,null,{"$f":"IF(Konfiguration!B636=\"\",\"\",Konfiguration!C636)","v":""},{"$f":"IF(Konfiguration!B635=\"\",\"\",Konfiguration!D635)","v":""},null,null,null,{"$f":"IF(B645=\"\",\"\",SUMIF(Ausgaben!B:B,B645,Ausgaben!A:A))","v":""},{"$f":"IF(B645=\"\",\"\",SUMIF(Einnahmen!B:B,B645,Einnahmen!A:A))","v":""}]
[null,{"$f":"IF(Konfiguration!B637=\"\",\"\",Konfiguration!B637)","v":""},null,null,null,{"$f":"IF(Konfiguration!B637=\"\",\"\",Konfiguration!C637)","v":""},{"$f":"IF(Konfiguration!B636=\"\",\"\",Konfiguration!D636)","v":""},null,null,null,{"$f":"IF(B646=\"\",\"\",SUMIF(Ausgaben!B:B,B646,Ausgaben!A:A))","v":""},{"$f":"IF(B646=\"\",\"\",SUMIF(Einnahmen!B:B,B646,Einnahmen!A:A))","v":""}]
[null,{"$f":"IF(Konfiguration!B638=\"\",\"\",Konfiguration!B638)","v":""},null,null,null,{"$f":"IF(Konfiguration!B638=\"\",\"\",Konfiguration!C638)","v":""},{"$f":"IF(Konfiguration!B637=\"\",\"\",Konfiguration!D637)","v":""},null,null,null,{"$f":"IF(B647=\"\",\"\",SUMIF(Ausgaben!B:B,B647,Ausgaben!A:A))","v":""},{"$f":"IF(B647=\"\",\"\",SUMIF(Einnahmen!B:B,B647,Einnahmen!A:A))","v":""}]
[null,{"$f":"IF(Konfiguration!B639=\"\",\"\",Konfiguration!B639)","v":""},null,null,null,{"$f":"IF(Konfiguration!B639=\"\",\"\",Konfiguration!C639)","v":""},{"$f":"IF(Konfiguration!B638=\"\",\"\",Konfiguration!D638)","v":""},null,null,null,{"$f":"IF(B648=\"\",\"\",SUMIF(Ausgaben!B:B,B648,Ausgaben!A:A))","v":""},{"$f":"IF(B648=\"\",\"\",SUMIF(Einnahmen!B:B,B648,Einnahmen!A:A))","v":""}]
[null,{"$f":"IF(Konfiguration!B640=\"\",\"\",Konfiguration!B640)","v":""},null,null,null,{"$f":"IF(Konfiguration!B640=\"\",\"\",Konfiguration!C640)","v":""},{"$f":"IF(Konfiguration!B639=\"\",\"\",Konfiguration!D639)","v":""},null,null,null,{"$f":"IF(B649=\"\",\"\",SUMIF(Ausgaben!B:B,B649,Ausgaben!A:A))","v":""},{"$f":"IF(B649=\"\",\"\",SUMIF(Einnahmen!B:B,B649,Einnahmen!A:A))","v":""}]
[null,{"$f":"IF(Konfiguration!B641=\"\",\"\",Konfiguration!B641)","v":""},null,null,null,{"$f":"IF(Konfiguration!B641=\"\",\"\",Konfiguration!C641)","v":""},{"$f":"IF(Konfiguration!B640=\"\",\"\",Konfiguration!D640)","v":""},null,null,null,{"$f":"IF(B650=\"\",\"\",SUMIF(Ausgaben!B:B,B650,Ausgaben!A:A))","v":""},{"$f":"IF(B650=\"\",\"\",SUMIF(Einnahmen!B:B,B650,Einnahmen!A:A))","v":""}]
[null,{"$f":"IF(Konfiguration!B642=\"\",\"\",Konfiguration!B642)","v":""},null,null,null,{"$f":"IF(Konfiguration!B642=\"\",\"\",Konfiguration!C642)","v":""},{"$f":"IF(Konfiguration!B641=\"\",\"\",Konfiguration!D641)","v":""},null,null,null,{"$f":"IF(B651=\"\",\"\",SUMIF(Ausgaben!B:B,B651,Ausgaben!A:A))","v":""},{"$f":"IF(B651=\"\",\"\",SUMIF(Einnahmen!B:B,B651,Einnahmen!A:A))","v":""}]
[null,{"$f":"IF(Konfiguration!B643=\"\",\"\",Konfiguration!B643)","v":""},null,null,null,{"$f":"IF(Konfiguration!B643=\"\",\"\",Konfiguration!C643)","v":""},{"$f":"IF(Konfiguration!B642=\"\",\"\",Konfiguration!D642)","v":""},null,null,null,{"$f":"IF(B652=\"\",\"\",SUMIF(Ausgaben!B:B,B652,Ausgaben!A:A))","v":""},{"$f":"IF(B652=\"\",\"\",SUMIF(Einnahmen!B:B,B652,Einnahmen!A:A))","v":""}]
[null,{"$f":"IF(Konfiguration!B644=\"\",\"\",Konfiguration!B644)","v":""},null,null,null,{"$f":"IF(Konfiguration!B644=\"\",\"\",Konfiguration!C644)","v":""},{"$f":"IF(Konfiguration!B643=\"\",\"\",Konfiguration!D643)","v":""},null,null,null,{"$f":"IF(B653=\"\",\"\",SUMIF(Ausgaben!B:B,B653,Ausgaben!A:A))","v":""},{"$f":"IF(B653=\"\",\"\",SUMIF(Einnahmen!B:B,B653,Einnahmen!A:A))","v":""}]
[null,{"$f":"IF(Konfiguration!B645=\"\",\"\",Konfiguration!B645)","v":""},null,null,null,{"$f":"IF(Konfiguration!B645=\"\",\"\",Konfiguration!C645)","v":""},{"$f":"IF(Konfiguration!B644=\"\",\"\",Konfiguration!D644)","v":""},null,null,null,{"$f":"IF(B654=\"\",\"\",SUMIF(Ausgaben!B:B,B654,Ausgaben!A:A))","v":""},{"$f":"IF(B654=\"\",\"\",SUMIF(Einnahmen!B:B,B654,Einnahmen!A:A))","v":""}]
[null,{"$f":"IF(Konfiguration!B646=\"\",\"\",Konfiguration!B646)","v":""},null,null,null,{"$f":"IF(Konfiguration!B646=\"\",\"\",Konfiguration!C646)","v":""},{"$f":"IF(Konfiguration!B645=\"\",\"\",Konfiguration!D645)","v":""},null,null,null,{"$f":"IF(B655=\"\",\"\",SUMIF(Ausgaben!B:B,B655,Ausgaben!A:A))","v":""},{"$f":"IF(B655=\"\",\"\",SUMIF(Einnahmen!B:B,B655,Einnahmen!A:A))","v":""}]
[null,{"$f":"IF(Konfiguration!B647=\"\",\"\",Konfiguration!B647)","v":""},null,null,null,{"$f":"IF(Konfiguration!B647=\"\",\"\",Konfiguration!C647)","v":""},{"$f":"IF(Konfiguration!B646=\"\",\"\",Konfiguration!D646)","v":""},null,null,null,{"$f":"IF(B656=\"\",\"\",SUMIF(Ausgaben!B:B,B656,Ausgaben!A:A))","v":""},{"$f":"IF(B656=\"\",\"\",SUMIF(Einnahmen!B:B,B656,Einnahmen!A:A))","v":""}]
[null,{"$f":"IF(Konfiguration!B648=\"\",\"\",Konfiguration!B648)","v":""},null,null,null,{"$f":"IF(Konfiguration!B648=\"\",\"\",Konfiguration!C648)","v":""},{"$f":"IF(Konfiguration!B647=\"\",\"\",Konfiguration!D647)","v":""},null,null,null,{"$f":"IF(B657=\"\",\"\",SUMIF(Ausgaben!B:B,B657,Ausgaben!A:A))","v":""},{"$f":"IF(B657=\"\",\"\",SUMIF(Einnahmen!B:B,B657,Einnahmen!A:A))","v":""}]
[null,{"$f":"IF(Konfiguration!B649=\"\",\"\",Konfiguration!B649)","v":""},null,null,null,{"$f":"IF(Konfiguration!B649=\"\",\"\",Konfiguration!C649)","v":""},{"$f":"IF(Konfiguration!B648=\"\",\"\",Konfiguration!D648)","v":""},null,null,null,{"$f":"IF(B658=\"\",\"\",SUMIF(Ausgaben!B:B,B658,Ausgaben!A:A))","v":""},{"$f":"IF(B658=\"\",\"\",SUMIF(Einnahmen!B:B,B658,Einnahmen!A:A))","v":""}]
[null,{"$f":"IF(Konfiguration!B650=\"\",\"\",Konfiguration!B650)","v":""},null,null,null,{"$f":"IF(Konfiguration!B650=\"\",\"\",Konfiguration!C650)","v":""},{"$f":"IF(Konfiguration!B649=\"\",\"\",Konfiguration!D649)","v":""},null,null,null,{"$f":"IF(B659=\"\",\"\",SUMIF(Ausgaben!B:B,B659,Ausgaben!A:A))","v":""},{"$f":"IF(B659=\"\",\"\",SUMIF(Einnahmen!B:B,B659,Einnahmen!A:A))","v":""}]
[null,{"$f":"IF(Konfiguration!B651=\"\",\"\",Konfiguration!B651)","v":""},null,null,null,{"$f":"IF(Konfiguration!B651=\"\",\"\",Konfiguration!C651)","v":""},{"$f":"IF(Konfiguration!B650=\"\",\"\",Konfiguration!D650)","v":""},null,null,null,{"$f":"IF(B660=\"\",\"\",SUMIF(Ausgaben!B:B,B660,Ausgaben!A:A))","v":""},{"$f":"IF(B660=\"\",\"\",SUMIF(Einnahmen!B:B,B660,Einnahmen!A:A))","v":""}]
[null,{"$f":"IF(Konfiguration!B652=\"\",\"\",Konfiguration!B652)","v":""},null,null,null,{"$f":"IF(Konfiguration!B652=\"\",\"\",Konfiguration!C652)","v":""},{"$f":"IF(Konfiguration!B651=\"\",\"\",Konfiguration!D651)","v":""},null,null,null,{"$f":"IF(B661=\"\",\"\",SUMIF(Ausgaben!B:B,B661,Ausgaben!A:A))","v":""},{"$f":"IF(B661=\"\",\"\",SUMIF(Einnahmen!B:B,B661,Einnahmen!A:A))","v":""}]
[null,{"$f":"IF(Konfiguration!B653=\"\",\"\",Konfiguration!B653)","v":""},null,null,null,{"$f":"IF(Konfiguration!B653=\"\",\"\",Konfiguration!C653)","v":""},{"$f":"IF(Konfiguration!B652=\"\",\"\",Konfiguration!D652)","v":""},null,null,null,{"$f":"IF(B662=\"\",\"\",SUMIF(Ausgaben!B:B,B662,Ausgaben!A:A))","v":""},{"$f":"IF(B662=\"\",\"\",SUMIF(Einnahmen!B:B,B662,Einnahmen!A:A))","v":""}]
[null,{"$f":"IF(Konfiguration!B654=\"\",\"\",Konfiguration!B654)","v":""},null,null,null,{"$f":"IF(Konfiguration!B654=\"\",\"\",Konfiguration!C654)","v":""},{"$f":"IF(Konfiguration!B654=\"\",\"\",Konfiguration!D654)","v":""},null,null,null,{"$f":"IF(B663=\"\",\"\",SUMIF(Ausgaben!B:B,B663,Ausgaben!A:A))","v":""},{"$f":"IF(B663=\"\",\"\",SUMIF(Einnahmen!B:B,B663,Einnahmen!A:A))","v":""}]
[null,{"$f":"IF(Konfiguration!B655=\"\",\"\",Konfiguration!B655)","v":""},null,null,null,{"$f":"IF(Konfiguration!B655=\"\",\"\",Konfiguration!C655)","v":""},{"$f":"IF(Konfiguration!B655=\"\",\"\",Konfiguration!D655)","v":""},null,null,null,{"$f":"IF(B664=\"\",\"\",SUMIF(Ausgaben!B:B,B664,Ausgaben!A:A))","v":""},{"$f":"IF(B664=\"\",\"\",SUMIF(Einnahmen!B:B,B664,Einnahmen!A:A))","v":""}]
[null,{"$f":"IF(Konfiguration!B656=\"\",\"\",Konfiguration!B656)","v":""},null,null,null,{"$f":"IF(Konfiguration!B656=\"\",\"\",Konfiguration!C656)","v":""},{"$f":"IF(Konfiguration!B656=\"\",\"\",Konfiguration!D656)","v":""},null,null,null,{"$f":"IF(B665=\"\",\"\",SUMIF(Ausgaben!B:B,B665,Ausgaben!A:A))","v":""},{"$f":"IF(B665=\"\",\"\",SUMIF(Einnahmen!B:B,B665,Einnahmen!A:A))","v":""}]
[null,{"$f":"IF(Konfiguration!B657=\"\",\"\",Konfiguration!B657)","v":""},null,null,null,{"$f":"IF(Konfiguration!B657=\"\",\"\",Konfiguration!C657)","v":""},{"$f":"IF(Konfiguration!B657=\"\",\"\",Konfiguration!D657)","v":""},null,null,null,{"$f":"IF(B666=\"\",\"\",SUMIF(Ausgaben!B:B,B666,Ausgaben!A:A))","v":""},{"$f":"IF(B666=\"\",\"\",SUMIF(Einnahmen!B:B,B666,Einnahmen!A:A))","v":""}]
[null,{"$f":"IF(Konfiguration!B658=\"\",\"\",Konfiguration!B658)","v":""},null,null,null,{"$f":"IF(Konfiguration!B658=\"\",\"\",Konfiguration!C658)","v":""},{"$f":"IF(Konfiguration!B658=\"\",\"\",Konfiguration!D658)","v":""},null,null,null,{"$f":"IF(B667=\"\",\"\",SUMIF(Ausgaben!B:B,B667,Ausgaben!A:A))","v":""},{"$f":"IF(B667=\"\",\"\",SUMIF(Einnahmen!B:B,B667,Einnahmen!A:A))","v":""}]
[null,{"$f":"IF(Konfiguration!B659=\"\",\"\",Konfiguration!B659)","v":""},null,null,null,{"$f":"IF(Konfiguration!B659=\"\",\"\",Konfiguration!C659)","v":""},{"$f":"IF(Konfiguration!B659=\"\",\"\",Konfiguration!D659)","v":""},null,null,null,{"$f":"IF(B668=\"\",\"\",SUMIF(Ausgaben!B:B,B668,Ausgaben!A:A))","v":""},{"$f":"IF(B668=\"\",\"\",SUMIF(Einnahmen!B:B,B668,Einnahmen!A:A))","v":""}]
[null,{"$f":"IF(Konfiguration!B660=\"\",\"\",Konfiguration!B660)","v":""},null,null,null,{"$f":"IF(Konfiguration!B660=\"\",\"\",Konfiguration!C660)","v":""},{"$f":"IF(Konfiguration!B660=\"\",\"\",Konfiguration!D660)","v":""},null,null,null,{"$f":"IF(B669=\"\",\"\",SUMIF(Ausgaben!B:B,B669,Ausgaben!A:A))","v":""},{"$f":"IF(B669=\"\",\"\",SUMIF(Einnahmen!B:B,B669,Einnahmen!A:A))","v":""}]
[null,{"$f":"IF(Konfiguration!B661=\"\",\"\",Konfiguration!B661)","v":""},null,null,null,{"$f":"IF(Konfiguration!B661=\"\",\"\",Konfiguration!C661)","v":""},{"$f":"IF(Konfiguration!B661=\"\",\"\",Konfiguration!D661)","v":""},null,null,null,{"$f":"IF(B670=\"\",\"\",SUMIF(Ausgaben!B:B,B670,Ausgaben!A:A))","v":""},{"$f":"IF(B670=\"\",\"\",SUMIF(Einnahmen!B:B,B670,Einnahmen!A:A))","v":""}]
[null,{"$f":"IF(Konfiguration!B662=\"\",\"\",Konfiguration!B662)","v":""},null,null,null,{"$f":"IF(Konfiguration!B662=\"\",\"\",Konfiguration!C662)","v":""},{"$f":"IF(Konfiguration!B662=\"\",\"\",Konfiguration!D662)","v":""},null,null,null,{"$f":"IF(B671=\"\",\"\",SUMIF(Ausgaben!B:B,B671,Ausgaben!A:A))","v":""},{"$f":"IF(B671=\"\",\"\",SUMIF(Einnahmen!B:B,B671,Einnahmen!A:A))","v":""}]
[null,{"$f":"IF(Konfiguration!B663=\"\",\"\",Konfiguration!B663)","v":""},null,null,null,{"$f":"IF(Konfiguration!B663=\"\",\"\",Konfiguration!C663)","v":""},{"$f":"IF(Konfiguration!B663=\"\",\"\",Konfiguration!D663)","v":""},null,null,null,{"$f":"IF(B672=\"\",\"\",SUMIF(Ausgaben!B:B,B672,Ausgaben!A:A))","v":""},{"$f":"IF(B672=\"\",\"\",SUMIF(Einnahmen!B:B,B672,Einnahmen!A:A))","v":""}]
[null,{"$f":"IF(Konfiguration!B664=\"\",\"\",Konfiguration!B664)","v":""},null,null,null,{"$f":"IF(Konfiguration!B664=\"\",\"\",Konfiguration!C664)","v":""},{"$f":"IF(Konfiguration!B664=\"\",\"\",Konfiguration!D664)","v":""},null,null,null,{"$f":"IF(B673=\"\",\"\",SUMIF(Ausgaben!B:B,B673,Ausgaben!A:A))","v":""},{"$f":"IF(B673=\"\",\"\",SUMIF(Einnahmen!B:B,B673,Einnahmen!A:A))","v":""}]
[null,{"$f":"IF(Konfiguration!B665=\"\",\"\",Konfiguration!B665)","v":""},null,null,null,{"$f":"IF(Konfiguration!B665=\"\",\"\",Konfiguration!C665)","v":""},{"$f":"IF(Konfiguration!B665=\"\",\"\",Konfiguration!D665)","v":""},null,null,null,{"$f":"IF(B674=\"\",\"\",SUMIF(Ausgaben!B:B,B674,Ausgaben!A:A))","v":""},{"$f":"IF(B674=\"\",\"\",SUMIF(Einnahmen!B:B,B674,Einnahmen!A:A))","v":""}]
[null,{"$f":"IF(Konfiguration!B666=\"\",\"\",Konfiguration!B666)","v":""},null,null,null,{"$f":"IF(Konfiguration!B666=\"\",\"\",Konfiguration!C666)","v":""},{"$f":"IF(Konfiguration!B666=\"\",\"\",Konfiguration!D666)","v":""},null,null,null,{"$f":"IF(B675=\"\",\"\",SUMIF(Ausgaben!B:B,B675,Ausgaben!A:A))","v":""},{"$f":"IF(B675=\"\",\"\",SUMIF(Einnahmen!B:B,B675,Einnahmen!A:A))","v":""}]
[null,{"$f":"IF(Konfiguration!B667=\"\",\"\",Konfiguration!B667)","v":""},null,null,null,{"$f":"IF(Konfiguration!B667=\"\",\"\",Konfiguration!C667)","v":""},{"$f":"IF(Konfiguration!B667=\"\",\"\",Konfiguration!D667)","v":""},null,null,null,{"$f":"IF(B676=\"\",\"\",SUMIF(Ausgaben!B:B,B676,Ausgaben!A:A))","v":""},{"$f":"IF(B676=\"\",\"\",SUMIF(Einnahmen!B:B,B676,Einnahmen!A:A))","v":""}]
[null,{"$f":"IF(Konfiguration!B668=\"\",\"\",Konfiguration!B668)","v":""},null,null,null,{"$f":"IF(Konfiguration!B668=\"\",\"\",Konfiguration!C668)","v":""},{"$f":"IF(Konfiguration!B668=\"\",\"\",Konfiguration!D668)","v":""},null,null,null,{"$f":"IF(B677=\"\",\"\",SUMIF(Ausgaben!B:B,B677,Ausgaben!A:A))","v":""},{"$f":"IF(B677=\"\",\"\",SUMIF(Einnahmen!B:B,B677,Einnahmen!A:A))","v":""}]
[null,{"$f":"IF(Konfiguration!B669=\"\",\"\",Konfiguration!B669)","v":""},null,null,null,{"$f":"IF(Konfiguration!B669=\"\",\"\",Konfiguration!C669)","v":""},{"$f":"IF(Konfiguration!B669=\"\",\"\",Konfiguration!D669)","v":""},null,null,null,{"$f":"IF(B678=\"\",\"\",SUMIF(Ausgaben!B:B,B678,Ausgaben!A:A))","v":""},{"$f":"IF(B678=\"\",\"\",SUMIF(Einnahmen!B:B,B678,Einnahmen!A:A))","v":""}]
[null,{"$f":"IF(Konfiguration!B670=\"\",\"\",Konfiguration!B670)","v":""},null,null,null,{"$f":"IF(Konfiguration!B670=\"\",\"\",Konfiguration!C670)","v":""},{"$f":"IF(Konfiguration!B670=\"\",\"\",Konfiguration!D670)","v":""},null,null,null,{"$f":"IF(B679=\"\",\"\",SUMIF(Ausgaben!B:B,B679,Ausgaben!A:A))","v":""},{"$f":"IF(B679=\"\",\"\",SUMIF(Einnahmen!B:B,B679,Einnahmen!A:A))","v":""}]
[null,{"$f":"IF(Konfiguration!B671=\"\",\"\",Konfiguration!B671)","v":""},null,null,null,{"$f":"IF(Konfiguration!B671=\"\",\"\",Konfiguration!C671)","v":""},{"$f":"IF(Konfiguration!B671=\"\",\"\",Konfiguration!D671)","v":""},null,null,null,{"$f":"IF(B680=\"\",\"\",SUMIF(Ausgaben!B:B,B680,Ausgaben!A:A))","v":""},{"$f":"IF(B680=\"\",\"\",SUMIF(Einnahmen!B:B,B680,Einnahmen!A:A))","v":""}]
[null,{"$f":"IF(Konfiguration!B672=\"\",\"\",Konfiguration!B672)","v":""},null,null,null,{"$f":"IF(Konfiguration!B672=\"\",\"\",Konfiguration!C672)","v":""},{"$f":"IF(Konfiguration!B672=\"\",\"\",Konfiguration!D672)","v":""},null,null,null,{"$f":"IF(B681=\"\",\"\",SUMIF(Ausgaben!B:B,B681,Ausgaben!A:A))","v":""},{"$f":"IF(B681=\"\",\"\",SUMIF(Einnahmen!B:B,B681,Einnahmen!A:A))","v":""}]
[null,{"$f":"IF(Konfiguration!B673=\"\",\"\",Konfiguration!B673)","v":""},null,null,null,{"$f":"IF(Konfiguration!B673=\"\",\"\",Konfiguration!C673)","v":""},{"$f":"IF(Konfiguration!B673=\"\",\"\",Konfiguration!D673)","v":""},null,null,null,{"$f":"IF(B682=\"\",\"\",SUMIF(Ausgaben!B:B,B682,Ausgaben!A:A))","v":""},{"$f":"IF(B682=\"\",\"\",SUMIF(Einnahmen!B:B,B682,Einnahmen!A:A))","v":""}]
[null,{"$f":"IF(Konfiguration!B674=\"\",\"\",Konfiguration!B674)","v":""},null,null,null,{"$f":"IF(Konfiguration!B674=\"\",\"\",Konfiguration!C674)","v":""},{"$f":"IF(Konfiguration!B674=\"\",\"\",Konfiguration!D674)","v":""},null,null,null,{"$f":"IF(B683=\"\",\"\",SUMIF(Ausgaben!B:B,B683,Ausgaben!A:A))","v":""},{"$f":"IF(B683=\"\",\"\",SUMIF(Einnahmen!B:B,B683,Einnahmen!A:A))","v":""}]
[null,{"$f":"IF(Konfiguration!B675=\"\",\"\",Konfiguration!B675)","v":""},null,null,null,{"$f":"IF(Konfiguration!B675=\"\",\"\",Konfiguration!C675)","v":""},{"$f":"IF(Konfiguration!B675=\"\",\"\",Konfiguration!D675)","v":""},null,null,null,{"$f":"IF(B684=\"\",\"\",SUMIF(Ausgaben!B:B,B684,Ausgaben!A:A))","v":""},{"$f":"IF(B684=\"\",\"\",SUMIF(Einnahmen!B:B,B684,Einnahmen!A:A))","v":""}]
[null,{"$f":"IF(Konfiguration!B676=\"\",\"\",Konfiguration!B676)","v":""},null,null,null,{"$f":"IF(Konfiguration!B676=\"\",\"\",Konfiguration!C676)","v":""},{"$f":"IF(Konfiguration!B676=\"\",\"\",Konfiguration!D676)","v":""},null,null,null,{"$f":"IF(B685=\"\",\"\",SUMIF(Ausgaben!B:B,B685,Ausgaben!A:A))","v":""},{"$f":"IF(B685=\"\",\"\",SUMIF(Einnahmen!B:B,B685,Einnahmen!A:A))","v":""}]
[null,{"$f":"IF(Konfiguration!B677=\"\",\"\",Konfiguration!B677)","v":""},null,null,null,{"$f":"IF(Konfiguration!B677=\"\",\"\",Konfiguration!C677)","v":""},{"$f":"IF(Konfiguration!B677=\"\",\"\",Konfiguration!D677)","v":""},null,null,null,{"$f":"IF(B686=\"\",\"\",SUMIF(Ausgaben!B:B,B686,Ausgaben!A:A))","v":""},{"$f":"IF(B686=\"\",\"\",SUMIF(Einnahmen!B:B,B686,Einnahmen!A:A))","v":""}]
[null,{"$f":"IF(Konfiguration!B678=\"\",\"\",Konfiguration!B678)","v":""},null,null,null,{"$f":"IF(Konfiguration!B678=\"\",\"\",Konfiguration!C678)","v":""},{"$f":"IF(Konfiguration!B678=\"\",\"\",Konfiguration!D678)","v":""},null,null,null,{"$f":"IF(B687=\"\",\"\",SUMIF(Ausgaben!B:B,B687,Ausgaben!A:A))","v":""},{"$f":"IF(B687=\"\",\"\",SUMIF(Einnahmen!B:B,B687,Einnahmen!A:A))","v":""}]
[null,{"$f":"IF(Konfiguration!B679=\"\",\"\",Konfiguration!B679)","v":""},null,null,null,{"$f":"IF(Konfiguration!B679=\"\",\"\",Konfiguration!C679)","v":""},{"$f":"IF(Konfiguration!B679=\"\",\"\",Konfiguration!D679)","v":""},null,null,null,{"$f":"IF(B688=\"\",\"\",SUMIF(Ausgaben!B:B,B688,Ausgaben!A:A))","v":""},{"$f":"IF(B688=\"\",\"\",SUMIF(Einnahmen!B:B,B688,Einnahmen!A:A))","v":""}]
[null,{"$f":"IF(Konfiguration!B680=\"\",\"\",Konfiguration!B680)","v":""},null,null,null,{"$f":"IF(Konfiguration!B680=\"\",\"\",Konfiguration!C680)","v":""},{"$f":"IF(Konfiguration!B680=\"\",\"\",Konfiguration!D680)","v":""},null,null,null,{"$f":"IF(B689=\"\",\"\",SUMIF(Ausgaben!B:B,B689,Ausgaben!A:A))","v":""},{"$f":"IF(B689=\"\",\"\",SUMIF(Einnahmen!B:B,B689,Einnahmen!A:A))","v":""}]
[null,{"$f":"IF(Konfiguration!B681=\"\",\"\",Konfiguration!B681)","v":""},null,null,null,{"$f":"IF(Konfiguration!B681=\"\",\"\",Konfiguration!C681)","v":""},{"$f":"IF(Konfiguration!B681=\"\",\"\",Konfiguration!D681)","v":""},null,null,null,{"$f":"IF(B690=\"\",\"\",SUMIF(Ausgaben!B:B,B690,Ausgaben!A:A))","v":""},{"$f":"IF(B690=\"\",\"\",SUMIF(Einnahmen!B:B,B690,Einnahmen!A:A))","v":""}]
[null,{"$f":"IF(Konfiguration!B682=\"\",\"\",Konfiguration!B682)","v":""},null,null,null,{"$f":"IF(Konfiguration!B682=\"\",\"\",Konfiguration!C682)","v":""},{"$f":"IF(Konfiguration!B682=\"\",\"\",Konfiguration!D682)","v":""},null,null,null,{"$f":"IF(B691=\"\",\"\",SUMIF(Ausgaben!B:B,B691,Ausgaben!A:A))","v":""},{"$f":"IF(B691=\"\",\"\",SUMIF(Einnahmen!B:B,B691,Einnahmen!A:A))","v":""}]
[null,{"$f":"IF(Konfiguration!B683=\"\",\"\",Konfiguration!B683)","v":""},null,null,null,{"$f":"IF(Konfiguration!B683=\"\",\"\",Konfiguration!C683)","v":""},{"$f":"IF(Konfiguration!B683=\"\",\"\",Konfiguration!D683)","v":""},null,null,null,{"$f":"IF(B692=\"\",\"\",SUMIF(Ausgaben!B:B,B692,Ausgaben!A:A))","v":""},{"$f":"IF(B692=\"\",\"\",SUMIF(Einnahmen!B:B,B692,Einnahmen!A:A))","v":""}]
[null,{"$f":"IF(Konfiguration!B684=\"\",\"\",Konfiguration!B684)","v":""},null,null,null,{"$f":"IF(Konfiguration!B684=\"\",\"\",Konfiguration!C684)","v":""},{"$f":"IF(Konfiguration!B684=\"\",\"\",Konfiguration!D684)","v":""},null,null,null,{"$f":"IF(B693=\"\",\"\",SUMIF(Ausgaben!B:B,B693,Ausgaben!A:A))","v":""},{"$f":"IF(B693=\"\",\"\",SUMIF(Einnahmen!B:B,B693,Einnahmen!A:A))","v":""}]
[null,{"$f":"IF(Konfiguration!B685=\"\",\"\",Konfiguration!B685)","v":""},null,null,null,{"$f":"IF(Konfiguration!B685=\"\",\"\",Konfiguration!C685)","v":""},{"$f":"IF(Konfiguration!B685=\"\",\"\",Konfiguration!D685)","v":""},null,null,null,{"$f":"IF(B694=\"\",\"\",SUMIF(Ausgaben!B:B,B694,Ausgaben!A:A))","v":""},{"$f":"IF(B694=\"\",\"\",SUMIF(Einnahmen!B:B,B694,Einnahmen!A:A))","v":""}]
[null,{"$f":"IF(Konfiguration!B686=\"\",\"\",Konfiguration!B686)","v":""},null,null,null,{"$f":"IF(Konfiguration!B686=\"\",\"\",Konfiguration!C686)","v":""},{"$f":"IF(Konfiguration!B686=\"\",\"\",Konfiguration!D686)","v":""},null,null,null,{"$f":"IF(B695=\"\",\"\",SUMIF(Ausgaben!B:B,B695,Ausgaben!A:A))","v":""},{"$f":"IF(B695=\"\",\"\",SUMIF(Einnahmen!B:B,B695,Einnahmen!A:A))","v":""}]
[null,{"$f":"IF(Konfiguration!B687=\"\",\"\",Konfiguration!B687)","v":""},null,null,null,{"$f":"IF(Konfiguration!B687=\"\",\"\",Konfiguration!C687)","v":""},{"$f":"IF(Konfiguration!B687=\"\",\"\",Konfiguration!D687)","v":""},null,null,null,{"$f":"IF(B696=\"\",\"\",SUMIF(Ausgaben!B:B,B696,Ausgaben!A:A))","v":""},{"$f":"IF(B696=\"\",\"\",SUMIF(Einnahmen!B:B,B696,Einnahmen!A:A))","v":""}]
[null,{"$f":"IF(Konfiguration!B688=\"\",\"\",Konfiguration!B688)","v":""},null,null,null,{"$f":"IF(Konfiguration!B688=\"\",\"\",Konfiguration!C688)","v":""},{"$f":"IF(Konfiguration!B688=\"\",\"\",Konfiguration!D688)","v":""},null,null,null,{"$f":"IF(B697=\"\",\"\",SUMIF(Ausgaben!B:B,B697,Ausgaben!A:A))","v":""},{"$f":"IF(B697=\"\",\"\",SUMIF(Einnahmen!B:B,B697,Einnahmen!A:A))","v":""}]
[null,{"$f":"IF(Konfiguration!B689=\"\",\"\",Konfiguration!B689)","v":""},null,null,null,{"$f":"IF(Konfiguration!B689=\"\",\"\",Konfiguration!C689)","v":""},{"$f":"IF(Konfiguration!B689=\"\",\"\",Konfiguration!D689)","v":""},null,null,null,{"$f":"IF(B698=\"\",\"\",SUMIF(Ausgaben!B:B,B698,Ausgaben!A:A))","v":""},{"$f":"IF(B698=\"\",\"\",SUMIF(Einnahmen!B:B,B698,Einnahmen!A:A))","v":""}]
[null,{"$f":"IF(Konfiguration!B690=\"\",\"\",Konfiguration!B690)","v":""},null,null,null,{"$f":"IF(Konfiguration!B690=\"\",\"\",Konfiguration!C690)","v":""},{"$f":"IF(Konfiguration!B690=\"\",\"\",Konfiguration!D690)","v":""},null,null,null,{"$f":"IF(B699=\"\",\"\",SUMIF(Ausgaben!B:B,B699,Ausgaben!A:A))","v":""},{"$f":"IF(B699=\"\",\"\",SUMIF(Einnahmen!B:B,B699,Einnahmen!A:A))","v":""}]
[null,{"$f":"IF(Konfiguration!B691=\"\",\"\",Konfiguration!B691)","v":""},null,null,null,{"$f":"IF(Konfiguration!B691=\"\",\"\",Konfiguration!C691)","v":""},{"$f":"IF(Konfiguration!B691=\"\",\"\",Konfiguration!D691)","v":""},null,null,null,{"$f":"IF(B700=\"\",\"\",SUMIF(Ausgaben!B:B,B700,Ausgaben!A:A))","v":""},{"$f":"IF(B700=\"\",\"\",SUMIF(Einnahmen!B:B,B700,Einnahmen!A:A))","v":""}]
[null,{"$f":"IF(Konfiguration!B692=\"\",\"\",Konfiguration!B692)","v":""},null,null,null,{"$f":"IF(Konfiguration!B692=\"\",\"\",Konfiguration!C692)","v":""},{"$f":"IF(Konfiguration!B692=\"\",\"\",Konfiguration!D692)","v":""},null,null,null,{"$f":"IF(B701=\"\",\"\",SUMIF(Ausgaben!B:B,B701,Ausgaben!A:A))","v":""},{"$f":"IF(B701=\"\",\"\",SUMIF(Einnahmen!B:B,B701,Einnahmen!A:A))","v":""}]
[null,{"$f":"IF(Konfiguration!B693=\"\",\"\",Konfiguration!B693)","v":""},null,null,null,{"$f":"IF(Konfiguration!B693=\"\",\"\",Konfiguration!C693)","v":""},{"$f":"IF(Konfiguration!B693=\"\",\"\",Konfiguration!D693)","v":""},null,null,null,{"$f":"IF(B702=\"\",\"\",SUMIF(Ausgaben!B:B,B702,Ausgaben!A:A))","v":""},{"$f":"IF(B702=\"\",\"\",SUMIF(Einnahmen!B:B,B702,Einnahmen!A:A))","v":""}]
[null,{"$f":"IF(Konfiguration!B694=\"\",\"\",Konfiguration!B694)","v":""},null,null,null,{"$f":"IF(Konfiguration!B694=\"\",\"\",Konfiguration!C694)","v":""},{"$f":"IF(Konfiguration!B694=\"\",\"\",Konfiguration!D694)","v":""},null,null,null,{"$f":"IF(B703=\"\",\"\",SUMIF(Ausgaben!B:B,B703,Ausgaben!A:A))","v":""},{"$f":"IF(B703=\"\",\"\",SUMIF(Einnahmen!B:B,B703,Einnahmen!A:A))","v":""}]
[null,{"$f":"IF(Konfiguration!B695=\"\",\"\",Konfiguration!B695)","v":""},null,null,null,{"$f":"IF(Konfiguration!B695=\"\",\"\",Konfiguration!C695)","v":""},{"$f":"IF(Konfiguration!B695=\"\",\"\",Konfiguration!D695)","v":""},null,null,null,{"$f":"IF(B704=\"\",\"\",SUMIF(Ausgaben!B:B,B704,Ausgaben!A:A))","v":""},{"$f":"IF(B704=\"\",\"\",SUMIF(Einnahmen!B:B,B704,Einnahmen!A:A))","v":""}]
[null,{"$f":"IF(Konfiguration!B696=\"\",\"\",Konfiguration!B696)","v":""},null,null,null,{"$f":"IF(Konfiguration!B696=\"\",\"\",Konfiguration!C696)","v":""},{"$f":"IF(Konfiguration!B696=\"\",\"\",Konfiguration!D696)","v":""},null,null,null,{"$f":"IF(B705=\"\",\"\",SUMIF(Ausgaben!B:B,B705,Ausgaben!A:A))","v":""},{"$f":"IF(B705=\"\",\"\",SUMIF(Einnahmen!B:B,B705,Einnahmen!A:A))","v":""}]
[null,{"$f":"IF(Konfiguration!B697=\"\",\"\",Konfiguration!B697)","v":""},null,null,null,{"$f":"IF(Konfiguration!B697=\"\",\"\",Konfiguration!C697)","v":""},{"$f":"IF(Konfiguration!B697=\"\",\"\",Konfiguration!D697)","v":""},null,null,null,{"$f":"IF(B706=\"\",\"\",SUMIF(Ausgaben!B:B,B706,Ausgaben!A:A))","v":""},{"$f":"IF(B706=\"\",\"\",SUMIF(Einnahmen!B:B,B706,Einnahmen!A:A))","v":""}]
[null,{"$f":"IF(Konfiguration!B698=\"\",\"\",Konfiguration!B698)","v":""},null,null,null,{"$f":"IF(Konfiguration!B698=\"\",\"\",Konfiguration!C698)","v":""},{"$f":"IF(Konfiguration!B698=\"\",\"\",Konfiguration!D698)","v":""},null,null,null,{"$f":"IF(B707=\"\",\"\",SUMIF(Ausgaben!B:B,B707,Ausgaben!A:A))","v":""},{"$f":"IF(B707=\"\",\"\",SUMIF(Einnahmen!B:B,B707,Einnahmen!A:A))","v":""}]
[null,{"$f":"IF(Konfiguration!B699=\"\",\"\",Konfiguration!B699)","v":""},null,null,null,{"$f":"IF(Konfiguration!B699=\"\",\"\",Konfiguration!C699)","v":""},{"$f":"IF(Konfiguration!B699=\"\",\"\",Konfiguration!D699)","v":""},null,null,null,{"$f":"IF(B708=\"\",\"\",SUMIF(Ausgaben!B:B,B708,Ausgaben!A:A))","v":""},{"$f":"IF(B708=\"\",\"\",SUMIF(Einnahmen!B:B,B708,Einnahmen!A:A))","v":""}]
[null,{"$f":"IF(Konfiguration!B700=\"\",\"\",Konfiguration!B700)","v":""},null,null,null,{"$f":"IF(Konfiguration!B700=\"\",\"\",Konfiguration!C700)","v":""},{"$f":"IF(Konfiguration!B700=\"\",\"\",Konfiguration!D700)","v":""},null,null,null,{"$f":"IF(B709=\"\",\"\",SUMIF(Ausgaben!B:B,B709,Ausgaben!A:A))","v":""},{"$f":"IF(B709=\"\",\"\",SUMIF(Einnahmen!B:B,B709,Einnahmen!A:A))","v":""}]
[null,{"$f":"IF(Konfiguration!B701=\"\",\"\",Konfiguration!B701)","v":""},null,null,null,{"$f":"IF(Konfiguration!B701=\"\",\"\",Konfiguration!C701)","v":""},{"$f":"IF(Konfiguration!B701=\"\",\"\",Konfiguration!D701)","v":""},null,null,null,{"$f":"IF(B710=\"\",\"\",SUMIF(Ausgaben!B:B,B710,Ausgaben!A:A))","v":""},{"$f":"IF(B710=\"\",\"\",SUMIF(Einnahmen!B:B,B710,Einnahmen!A:A))","v":""}]
[null,{"$f":"IF(Konfiguration!B702=\"\",\"\",Konfiguration!B702)","v":""},null,null,null,{"$f":"IF(Konfiguration!B702=\"\",\"\",Konfiguration!C702)","v":""},{"$f":"IF(Konfiguration!B702=\"\",\"\",Konfiguration!D702)","v":""},null,null,null,{"$f":"IF(B711=\"\",\"\",SUMIF(Ausgaben!B:B,B711,Ausgaben!A:A))","v":""},{"$f":"IF(B711=\"\",\"\",SUMIF(Einnahmen!B:B,B711,Einnahmen!A:A))","v":""}]
[null,{"$f":"IF(Konfiguration!B703=\"\",\"\",Konfiguration!B703)","v":""},null,null,null,{"$f":"IF(Konfiguration!B703=\"\",\"\",Konfiguration!C703)","v":""},{"$f":"IF(Konfiguration!B703=\"\",\"\",Konfiguration!D703)","v":""},null,null,null,{"$f":"IF(B712=\"\",\"\",SUMIF(Ausgaben!B:B,B712,Ausgaben!A:A))","v":""},{"$f":"IF(B712=\"\",\"\",SUMIF(Einnahmen!B:B,B712,Einnahmen!A:A))","v":""}]
[null,{"$f":"IF(Konfiguration!B704=\"\",\"\",Konfiguration!B704)","v":""},null,null,null,{"$f":"IF(Konfiguration!B704=\"\",\"\",Konfiguration!C704)","v":""},{"$f":"IF(Konfiguration!B704=\"\",\"\",Konfiguration!D704)","v":""},null,null,null,{"$f":"IF(B713=\"\",\"\",SUMIF(Ausgaben!B:B,B713,Ausgaben!A:A))","v":""},{"$f":"IF(B713=\"\",\"\",SUMIF(Einnahmen!B:B,B713,Einnahmen!A:A))","v":""}]
[null,{"$f":"IF(Konfiguration!B705=\"\",\"\",Konfiguration!B705)","v":""},null,null,null,{"$f":"IF(Konfiguration!B705=\"\",\"\",Konfiguration!C705)","v":""},{"$f":"IF(Konfiguration!B705=\"\",\"\",Konfiguration!D705)","v":""},null,null,null,{"$f":"IF(B714=\"\",\"\",SUMIF(Ausgaben!B:B,B714,Ausgaben!A:A))","v":""},{"$f":"IF(B714=\"\",\"\",SUMIF(Einnahmen!B:B,B714,Einnahmen!A:A))","v":""}]
[null,{"$f":"IF(Konfiguration!B706=\"\",\"\",Konfiguration!B706)","v":""},null,null,null,{"$f":"IF(Konfiguration!B706=\"\",\"\",Konfiguration!C706)","v":""},{"$f":"IF(Konfiguration!B706=\"\",\"\",Konfiguration!D706)","v":""},null,null,null,{"$f":"IF(B715=\"\",\"\",SUMIF(Ausgaben!B:B,B715,Ausgaben!A:A))","v":""},{"$f":"IF(B715=\"\",\"\",SUMIF(Einnahmen!B:B,B715,Einnahmen!A:A))","v":""}]
[null,{"$f":"IF(Konfiguration!B707=\"\",\"\",Konfiguration!B707)","v":""},null,null,null,{"$f":"IF(Konfiguration!B707=\"\",\"\",Konfiguration!C707)","v":""},{"$f":"IF(Konfiguration!B707=\"\",\"\",Konfiguration!D707)","v":""},null,null,null,{"$f":"IF(B716=\"\",\"\",SUMIF(Ausgaben!B:B,B716,Ausgaben!A:A))","v":""},{"$f":"IF(B716=\"\",\"\",SUMIF(Einnahmen!B:B,B716,Einnahmen!A:A))","v":""}]
[null,{"$f":"IF(Konfiguration!B708=\"\",\"\",Konfiguration!B708)","v":""},null,null,null,{"$f":"IF(Konfiguration!B708=\"\",\"\",Konfiguration!C708)","v":""},{"$f":"IF(Konfiguration!B708=\"\",\"\",Konfiguration!D708)","v":""},null,null,null,{"$f":"IF(B717=\"\",\"\",SUMIF(Ausgaben!B:B,B717,Ausgaben!A:A))","v":""},{"$f":"IF(B717=\"\",\"\",SUMIF(Einnahmen!B:B,B717,Einnahmen!A:A))","v":""}]
[null,{"$f":"IF(Konfiguration!B709=\"\",\"\",Konfiguration!B709)","v":""},null,null,null,{"$f":"IF(Konfiguration!B709=\"\",\"\",Konfiguration!C709)","v":""},{"$f":"IF(Konfiguration!B709=\"\",\"\",Konfiguration!D709)","v":""},null,null,null,{"$f":"IF(B718=\"\",\"\",SUMIF(Ausgaben!B:B,B718,Ausgaben!A:A))","v":""},{"$f":"IF(B718=\"\",\"\",SUMIF(Einnahmen!B:B,B718,Einnahmen!A:A))","v":""}]
[null,{"$f":"IF(Konfiguration!B710=\"\",\"\",Konfiguration!B710)","v":""},null,null,null,{"$f":"IF(Konfiguration!B710=\"\",\"\",Konfiguration!C710)","v":""},{"$f":"IF(Konfiguration!B710=\"\",\"\",Konfiguration!D710)","v":""},null,null,null,{"$f":"IF(B719=\"\",\"\",SUMIF(Ausgaben!B:B,B719,Ausgaben!A:A))","v":""},{"$f":"IF(B719=\"\",\"\",SUMIF(Einnahmen!B:B,B719,Einnahmen!A:A))","v":""}]
[null,{"$f":"IF(Konfiguration!B711=\"\",\"\",Konfiguration!B711)","v":""},null,null,null,{"$f":"IF(Konfiguration!B711=\"\",\"\",Konfiguration!C711)","v":""},{"$f":"IF(Konfiguration!B711=\"\",\"\",Konfiguration!D711)","v":""},null,null,null,{"$f":"IF(B720=\"\",\"\",SUMIF(Ausgaben!B:B,B720,Ausgaben!A:A))","v":""},{"$f":"IF(B720=\"\",\"\",SUMIF(Einnahmen!B:B,B720,Einnahmen!A:A))","v":""}]
[null,{"$f":"IF(Konfiguration!B712=\"\",\"\",Konfiguration!B712)","v":""},null,null,null,{"$f":"IF(Konfiguration!B712=\"\",\"\",Konfiguration!C712)","v":""},{"$f":"IF(Konfiguration!B712=\"\",\"\",Konfiguration!D712)","v":""},null,null,null,{"$f":"IF(B721=\"\",\"\",SUMIF(Ausgaben!B:B,B721,Ausgaben!A:A))","v":""},{"$f":"IF(B721=\"\",\"\",SUMIF(Einnahmen!B:B,B721,Einnahmen!A:A))","v":""}]
[null,{"$f":"IF(Konfiguration!B713=\"\",\"\",Konfiguration!B713)","v":""},null,null,null,{"$f":"IF(Konfiguration!B713=\"\",\"\",Konfiguration!C713)","v":""},{"$f":"IF(Konfiguration!B713=\"\",\"\",Konfiguration!D713)","v":""},null,null,null,{"$f":"IF(B722=\"\",\"\",SUMIF(Ausgaben!B:B,B722,Ausgaben!A:A))","v":""},{"$f":"IF(B722=\"\",\"\",SUMIF(Einnahmen!B:B,B722,Einnahmen!A:A))","v":""}]
[null,{"$f":"IF(Konfiguration!B714=\"\",\"\",Konfiguration!B714)","v":""},null,null,null,{"$f":"IF(Konfiguration!B714=\"\",\"\",Konfiguration!C714)","v":""},{"$f":"IF(Konfiguration!B714=\"\",\"\",Konfiguration!D714)","v":""},null,null,null,{"$f":"IF(B723=\"\",\"\",SUMIF(Ausgaben!B:B,B723,Ausgaben!A:A))","v":""},{"$f":"IF(B723=\"\",\"\",SUMIF(Einnahmen!B:B,B723,Einnahmen!A:A))","v":""}]
[null,{"$f":"IF(Konfiguration!B715=\"\",\"\",Konfiguration!B715)","v":""},null,null,null,{"$f":"IF(Konfiguration!B715=\"\",\"\",Konfiguration!C715)","v":""},{"$f":"IF(Konfiguration!B715=\"\",\"\",Konfiguration!D715)","v":""},null,null,null,{"$f":"IF(B724=\"\",\"\",SUMIF(Ausgaben!B:B,B724,Ausgaben!A:A))","v":""},{"$f":"IF(B724=\"\",\"\",SUMIF(Einnahmen!B:B,B724,Einnahmen!A:A))","v":""}]
[null,{"$f":"IF(Konfiguration!B716=\"\",\"\",Konfiguration!B716)","v":""},null,null,null,{"$f":"IF(Konfiguration!B716=\"\",\"\",Konfiguration!C716)","v":""},{"$f":"IF(Konfiguration!B716=\"\",\"\",Konfiguration!D716)","v":""},null,null,null,{"$f":"IF(B725=\"\",\"\",SUMIF(Ausgaben!B:B,B725,Ausgaben!A:A))","v":""},{"$f":"IF(B725=\"\",\"\",SUMIF(Einnahmen!B:B,B725,Einnahmen!A:A))","v":""}]
[null,{"$f":"IF(Konfiguration!B717=\"\",\"\",Konfiguration!B717)","v":""},null,null,null,{"$f":"IF(Konfiguration!B717=\"\",\"\",Konfiguration!C717)","v":""},{"$f":"IF(Konfiguration!B717=\"\",\"\",Konfiguration!D717)","v":""},null,null,null,{"$f":"IF(B726=\"\",\"\",SUMIF(Ausgaben!B:B,B726,Ausgaben!A:A))","v":""},{"$f":"IF(B726=\"\",\"\",SUMIF(Einnahmen!B:B,B726,Einnahmen!A:A))","v":""}]
[null,{"$f":"IF(Konfiguration!B718=\"\",\"\",Konfiguration!B718)","v":""},null,null,null,{"$f":"IF(Konfiguration!B718=\"\",\"\",Konfiguration!C718)","v":""},{"$f":"IF(Konfiguration!B718=\"\",\"\",Konfiguration!D718)","v":""},null,null,null,{"$f":"IF(B727=\"\",\"\",SUMIF(Ausgaben!B:B,B727,Ausgaben!A:A))","v":""},{"$f":"IF(B727=\"\",\"\",SUMIF(Einnahmen!B:B,B727,Einnahmen!A:A))","v":""}]
[null,{"$f":"IF(Konfiguration!B719=\"\",\"\",Konfiguration!B719)","v":""},null,null,null,{"$f":"IF(Konfiguration!B719=\"\",\"\",Konfiguration!C719)","v":""},{"$f":"IF(Konfiguration!B719=\"\",\"\",Konfiguration!D719)","v":""},null,null,null,{"$f":"IF(B728=\"\",\"\",SUMIF(Ausgaben!B:B,B728,Ausgaben!A:A))","v":""},{"$f":"IF(B728=\"\",\"\",SUMIF(Einnahmen!B:B,B728,Einnahmen!A:A))","v":""}]
[null,{"$f":"IF(Konfiguration!B720=\"\",\"\",Konfiguration!B720)","v":""},null,null,null,{"$f":"IF(Konfiguration!B720=\"\",\"\",Konfiguration!C720)","v":""},{"$f":"IF(Konfiguration!B720=\"\",\"\",Konfiguration!D720)","v":""},null,null,null,{"$f":"IF(B729=\"\",\"\",SUMIF(Ausgaben!B:B,B729,Ausgaben!A:A))","v":""},{"$f":"IF(B729=\"\",\"\",SUMIF(Einnahmen!B:B,B729,Einnahmen!A:A))","v":""}]
[null,{"$f":"IF(Konfiguration!B721=\"\",\"\",Konfiguration!B721)","v":""},null,null,null,{"$f":"IF(Konfiguration!B721=\"\",\"\",Konfiguration!C721)","v":""},{"$f":"IF(Konfiguration!B721=\"\",\"\",Konfiguration!D721)","v":""},null,null,null,{"$f":"IF(B730=\"\",\"\",SUMIF(Ausgaben!B:B,B730,Ausgaben!A:A))","v":""},{"$f":"IF(B730=\"\",\"\",SUMIF(Einnahmen!B:B,B730,Einnahmen!A:A))","v":""}]
[null,{"$f":"IF(Konfiguration!B722=\"\",\"\",Konfiguration!B722)","v":""},null,null,null,{"$f":"IF(Konfiguration!B722=\"\",\"\",Konfiguration!C722)","v":""},{"$f":"IF(Konfiguration!B722=\"\",\"\",Konfiguration!D722)","v":""},null,null,null,{"$f":"IF(B731=\"\",\"\",SUMIF(Ausgaben!B:B,B731,Ausgaben!A:A))","v":""},{"$f":"IF(B731=\"\",\"\",SUMIF(Einnahmen!B:B,B731,Einnahmen!A:A))","v":""}]
[null,{"$f":"IF(Konfiguration!B723=\"\",\"\",Konfiguration!B723)","v":""},null,null,null,{"$f":"IF(Konfiguration!B723=\"\",\"\",Konfiguration!C723)","v":""},{"$f":"IF(Konfiguration!B723=\"\",\"\",Konfiguration!D723)","v":""},null,null,null,{"$f":"IF(B732=\"\",\"\",SUMIF(Ausgaben!B:B,B732,Ausgaben!A:A))","v":""},{"$f":"IF(B732=\"\",\"\",SUMIF(Einnahmen!B:B,B732,Einnahmen!A:A))","v":""}]
[null,{"$f":"IF(Konfiguration!B724=\"\",\"\",Konfiguration!B724)","v":""},null,null,null,{"$f":"IF(Konfiguration!B724=\"\",\"\",Konfiguration!C724)","v":""},{"$f":"IF(Konfiguration!B724=\"\",\"\",Konfiguration!D724)","v":""},null,null,null,{"$f":"IF(B733=\"\",\"\",SUMIF(Ausgaben!B:B,B733,Ausgaben!A:A))","v":""},{"$f":"IF(B733=\"\",\"\",SUMIF(Einnahmen!B:B,B733,Einnahmen!A:A))","v":""}]
[null,{"$f":"IF(Konfiguration!B725=\"\",\"\",Konfiguration!B725)","v":""},null,null,null,{"$f":"IF(Konfiguration!B725=\"\",\"\",Konfiguration!C725)","v":""},{"$f":"IF(Konfiguration!B725=\"\",\"\",Konfiguration!D725)","v":""},null,null,null,{"$f":"IF(B734=\"\",\"\",SUMIF(Ausgaben!B:B,B734,Ausgaben!A:A))","v":""},{"$f":"IF(B734=\"\",\"\",SUMIF(Einnahmen!B:B,B734,Einnahmen!A:A))","v":""}]
[null,{"$f":"IF(Konfiguration!B726=\"\",\"\",Konfiguration!B726)","v":""},null,null,null,{"$f":"IF(Konfiguration!B726=\"\",\"\",Konfiguration!C726)","v":""},{"$f":"IF(Konfiguration!B726=\"\",\"\",Konfiguration!D726)","v":""},null,null,null,{"$f":"IF(B735=\"\",\"\",SUMIF(Ausgaben!B:B,B735,Ausgaben!A:A))","v":""},{"$f":"IF(B735=\"\",\"\",SUMIF(Einnahmen!B:B,B735,Einnahmen!A:A))","v":""}]
[null,{"$f":"IF(Konfiguration!B727=\"\",\"\",Konfiguration!B727)","v":""},null,null,null,{"$f":"IF(Konfiguration!B727=\"\",\"\",Konfiguration!C727)","v":""},{"$f":"IF(Konfiguration!B727=\"\",\"\",Konfiguration!D727)","v":""},null,null,null,{"$f":"IF(B736=\"\",\"\",SUMIF(Ausgaben!B:B,B736,Ausgaben!A:A))","v":""},{"$f":"IF(B736=\"\",\"\",SUMIF(Einnahmen!B:B,B736,Einnahmen!A:A))","v":""}]
[null,{"$f":"IF(Konfiguration!B728=\"\",\"\",Konfiguration!B728)","v":""},null,null,null,{"$f":"IF(Konfiguration!B728=\"\",\"\",Konfiguration!C728)","v":""},{"$f":"IF(Konfiguration!B728=\"\",\"\",Konfiguration!D728)","v":""},null,null,null,{"$f":"IF(B737=\"\",\"\",SUMIF(Ausgaben!B:B,B737,Ausgaben!A:A))","v":""},{"$f":"IF(B737=\"\",\"\",SUMIF(Einnahmen!B:B,B737,Einnahmen!A:A))","v":""}]
[null,{"$f":"IF(Konfiguration!B729=\"\",\"\",Konfiguration!B729)","v":""},null,null,null,{"$f":"IF(Konfiguration!B729=\"\",\"\",Konfiguration!C729)","v":""},{"$f":"IF(Konfiguration!B729=\"\",\"\",Konfiguration!D729)","v":""},null,null,null,{"$f":"IF(B738=\"\",\"\",SUMIF(Ausgaben!B:B,B738,Ausgaben!A:A))","v":""},{"$f":"IF(B738=\"\",\"\",SUMIF(Einnahmen!B:B,B738,Einnahmen!A:A))","v":""}]
[null,{"$f":"IF(Konfiguration!B730=\"\",\"\",Konfiguration!B730)","v":""},null,null,null,{"$f":"IF(Konfiguration!B730=\"\",\"\",Konfiguration!C730)","v":""},{"$f":"IF(Konfiguration!B730=\"\",\"\",Konfiguration!D730)","v":""},null,null,null,{"$f":"IF(B739=\"\",\"\",SUMIF(Ausgaben!B:B,B739,Ausgaben!A:A))","v":""},{"$f":"IF(B739=\"\",\"\",SUMIF(Einnahmen!B:B,B739,Einnahmen!A:A))","v":""}]
[null,{"$f":"IF(Konfiguration!B731=\"\",\"\",Konfiguration!B731)","v":""},null,null,null,{"$f":"IF(Konfiguration!B731=\"\",\"\",Konfiguration!C731)","v":""},{"$f":"IF(Konfiguration!B731=\"\",\"\",Konfiguration!D731)","v":""},null,null,null,{"$f":"IF(B740=\"\",\"\",SUMIF(Ausgaben!B:B,B740,Ausgaben!A:A))","v":""},{"$f":"IF(B740=\"\",\"\",SUMIF(Einnahmen!B:B,B740,Einnahmen!A:A))","v":""}]
[null,{"$f":"IF(Konfiguration!B732=\"\",\"\",Konfiguration!B732)","v":""},null,null,null,{"$f":"IF(Konfiguration!B732=\"\",\"\",Konfiguration!C732)","v":""},{"$f":"IF(Konfiguration!B732=\"\",\"\",Konfiguration!D732)","v":""},null,null,null,{"$f":"IF(B741=\"\",\"\",SUMIF(Ausgaben!B:B,B741,Ausgaben!A:A))","v":""},{"$f":"IF(B741=\"\",\"\",SUMIF(Einnahmen!B:B,B741,Einnahmen!A:A))","v":""}]
[null,{"$f":"IF(Konfiguration!B733=\"\",\"\",Konfiguration!B733)","v":""},null,null,null,{"$f":"IF(Konfiguration!B733=\"\",\"\",Konfiguration!C733)","v":""},{"$f":"IF(Konfiguration!B733=\"\",\"\",Konfiguration!D733)","v":""},null,null,null,{"$f":"IF(B742=\"\",\"\",SUMIF(Ausgaben!B:B,B742,Ausgaben!A:A))","v":""},{"$f":"IF(B742=\"\",\"\",SUMIF(Einnahmen!B:B,B742,Einnahmen!A:A))","v":""}]
[null,{"$f":"IF(Konfiguration!B734=\"\",\"\",Konfiguration!B734)","v":""},null,null,null,{"$f":"IF(Konfiguration!B734=\"\",\"\",Konfiguration!C734)","v":""},{"$f":"IF(Konfiguration!B734=\"\",\"\",Konfiguration!D734)","v":""},null,null,null,{"$f":"IF(B743=\"\",\"\",SUMIF(Ausgaben!B:B,B743,Ausgaben!A:A))","v":""},{"$f":"IF(B743=\"\",\"\",SUMIF(Einnahmen!B:B,B743,Einnahmen!A:A))","v":""}]
[null,{"$f":"IF(Konfiguration!B735=\"\",\"\",Konfiguration!B735)","v":""},null,null,null,{"$f":"IF(Konfiguration!B735=\"\",\"\",Konfiguration!C735)","v":""},{"$f":"IF(Konfiguration!B735=\"\",\"\",Konfiguration!D735)","v":""},null,null,null,{"$f":"IF(B744=\"\",\"\",SUMIF(Ausgaben!B:B,B744,Ausgaben!A:A))","v":""},{"$f":"IF(B744=\"\",\"\",SUMIF(Einnahmen!B:B,B744,Einnahmen!A:A))","v":""}]
[null,{"$f":"IF(Konfiguration!B736=\"\",\"\",Konfiguration!B736)","v":""},null,null,null,{"$f":"IF(Konfiguration!B736=\"\",\"\",Konfiguration!C736)","v":""},{"$f":"IF(Konfiguration!B736=\"\",\"\",Konfiguration!D736)","v":""},null,null,null,{"$f":"IF(B745=\"\",\"\",SUMIF(Ausgaben!B:B,B745,Ausgaben!A:A))","v":""},{"$f":"IF(B745=\"\",\"\",SUMIF(Einnahmen!B:B,B745,Einnahmen!A:A))","v":""}]
[null,{"$f":"IF(Konfiguration!B737=\"\",\"\",Konfiguration!B737)","v":""},null,null,null,{"$f":"IF(Konfiguration!B737=\"\",\"\",Konfiguration!C737)","v":""},{"$f":"IF(Konfiguration!B737=\"\",\"\",Konfiguration!D737)","v":""},null,null,null,{"$f":"IF(B746=\"\",\"\",SUMIF(Ausgaben!B:B,B746,Ausgaben!A:A))","v":""},{"$f":"IF(B746=\"\",\"\",SUMIF(Einnahmen!B:B,B746,Einnahmen!A:A))","v":""}]
[null,{"$f":"IF(Konfiguration!B738=\"\",\"\",Konfiguration!B738)","v":""},null,null,null,{"$f":"IF(Konfiguration!B738=\"\",\"\",Konfiguration!C738)","v":""},{"$f":"IF(Konfiguration!B738=\"\",\"\",Konfiguration!D738)","v":""},null,null,null,{"$f":"IF(B747=\"\",\"\",SUMIF(Ausgaben!B:B,B747,Ausgaben!A:A))","v":""},{"$f":"IF(B747=\"\",\"\",SUMIF(Einnahmen!B:B,B747,Einnahmen!A:A))","v":""}]
[null,{"$f":"IF(Konfiguration!B739=\"\",\"\",Konfiguration!B739)","v":""},null,null,null,{"$f":"IF(Konfiguration!B739=\"\",\"\",Konfiguration!C739)","v":""},{"$f":"IF(Konfiguration!B739=\"\",\"\",Konfiguration!D739)","v":""},null,null,null,{"$f":"IF(B748=\"\",\"\",SUMIF(Ausgaben!B:B,B748,Ausgaben!A:A))","v":""},{"$f":"IF(B748=\"\",\"\",SUMIF(Einnahmen!B:B,B748,Einnahmen!A:A))","v":""}]
[null,{"$f":"IF(Konfiguration!B740=\"\",\"\",Konfiguration!B740)","v":""},null,null,null,{"$f":"IF(Konfiguration!B740=\"\",\"\",Konfiguration!C740)","v":""},{"$f":"IF(Konfiguration!B740=\"\",\"\",Konfiguration!D740)","v":""},null,null,null,{"$f":"IF(B749=\"\",\"\",SUMIF(Ausgaben!B:B,B749,Ausgaben!A:A))","v":""},{"$f":"IF(B749=\"\",\"\",SUMIF(Einnahmen!B:B,B749,Einnahmen!A:A))","v":""}]
[null,{"$f":"IF(Konfiguration!B741=\"\",\"\",Konfiguration!B741)","v":""},null,null,null,{"$f":"IF(Konfiguration!B741=\"\",\"\",Konfiguration!C741)","v":""},{"$f":"IF(Konfiguration!B741=\"\",\"\",Konfiguration!D741)","v":""},null,null,null,{"$f":"IF(B750=\"\",\"\",SUMIF(Ausgaben!B:B,B750,Ausgaben!A:A))","v":""},{"$f":"IF(B750=\"\",\"\",SUMIF(Einnahmen!B:B,B750,Einnahmen!A:A))","v":""}]
[null,{"$f":"IF(Konfiguration!B742=\"\",\"\",Konfiguration!B742)","v":""},null,null,null,{"$f":"IF(Konfiguration!B742=\"\",\"\",Konfiguration!C742)","v":""},{"$f":"IF(Konfiguration!B742=\"\",\"\",Konfiguration!D742)","v":""},null,null,null,{"$f":"IF(B751=\"\",\"\",SUMIF(Ausgaben!B:B,B751,Ausgaben!A:A))","v":""},{"$f":"IF(B751=\"\",\"\",SUMIF(Einnahmen!B:B,B751,Einnahmen!A:A))","v":""}]
[null,{"$f":"IF(Konfiguration!B743=\"\",\"\",Konfiguration!B743)","v":""},null,null,null,{"$f":"IF(Konfiguration!B743=\"\",\"\",Konfiguration!C743)","v":""},{"$f":"IF(Konfiguration!B743=\"\",\"\",Konfiguration!D743)","v":""},null,null,null,{"$f":"IF(B752=\"\",\"\",SUMIF(Ausgaben!B:B,B752,Ausgaben!A:A))","v":""},{"$f":"IF(B752=\"\",\"\",SUMIF(Einnahmen!B:B,B752,Einnahmen!A:A))","v":""}]
[null,{"$f":"IF(Konfiguration!B744=\"\",\"\",Konfiguration!B744)","v":""},null,null,null,{"$f":"IF(Konfiguration!B744=\"\",\"\",Konfiguration!C744)","v":""},{"$f":"IF(Konfiguration!B744=\"\",\"\",Konfiguration!D744)","v":""},null,null,null,{"$f":"IF(B753=\"\",\"\",SUMIF(Ausgaben!B:B,B753,Ausgaben!A:A))","v":""},{"$f":"IF(B753=\"\",\"\",SUMIF(Einnahmen!B:B,B753,Einnahmen!A:A))","v":""}]
[null,{"$f":"IF(Konfiguration!B745=\"\",\"\",Konfiguration!B745)","v":""},null,null,null,{"$f":"IF(Konfiguration!B745=\"\",\"\",Konfiguration!C745)","v":""},{"$f":"IF(Konfiguration!B745=\"\",\"\",Konfiguration!D745)","v":""},null,null,null,{"$f":"IF(B754=\"\",\"\",SUMIF(Ausgaben!B:B,B754,Ausgaben!A:A))","v":""},{"$f":"IF(B754=\"\",\"\",SUMIF(Einnahmen!B:B,B754,Einnahmen!A:A))","v":""}]
[null,{"$f":"IF(Konfiguration!B746=\"\",\"\",Konfiguration!B746)","v":""},null,null,null,{"$f":"IF(Konfiguration!B746=\"\",\"\",Konfiguration!C746)","v":""},{"$f":"IF(Konfiguration!B746=\"\",\"\",Konfiguration!D746)","v":""},null,null,null,{"$f":"IF(B755=\"\",\"\",SUMIF(Ausgaben!B:B,B755,Ausgaben!A:A))","v":""},{"$f":"IF(B755=\"\",\"\",SUMIF(Einnahmen!B:B,B755,Einnahmen!A:A))","v":""}]
[null,{"$f":"IF(Konfiguration!B747=\"\",\"\",Konfiguration!B747)","v":""},null,null,null,{"$f":"IF(Konfiguration!B747=\"\",\"\",Konfiguration!C747)","v":""},{"$f":"IF(Konfiguration!B747=\"\",\"\",Konfiguration!D747)","v":""},null,null,null,{"$f":"IF(B756=\"\",\"\",SUMIF(Ausgaben!B:B,B756,Ausgaben!A:A))","v":""},{"$f":"IF(B756=\"\",\"\",SUMIF(Einnahmen!B:B,B756,Einnahmen!A:A))","v":""}]
[null,{"$f":"IF(Konfiguration!B748=\"\",\"\",Konfiguration!B748)","v":""},null,null,null,{"$f":"IF(Konfiguration!B748=\"\",\"\",Konfiguration!C748)","v":""},{"$f":"IF(Konfiguration!B748=\"\",\"\",Konfiguration!D748)","v":""},null,null,null,{"$f":"IF(B757=\"\",\"\",SUMIF(Ausgaben!B:B,B757,Ausgaben!A:A))","v":""},{"$f":"IF(B757=\"\",\"\",SUMIF(Einnahmen!B:B,B757,Einnahmen!A:A))","v":""}]
[null,{"$f":"IF(Konfiguration!B749=\"\",\"\",Konfiguration!B749)","v":""},null,null,null,{"$f":"IF(Konfiguration!B749=\"\",\"\",Konfiguration!C749)","v":""},{"$f":"IF(Konfiguration!B749=\"\",\"\",Konfiguration!D749)","v":""},null,null,null,{"$f":"IF(B758=\"\",\"\",SUMIF(Ausgaben!B:B,B758,Ausgaben!A:A))","v":""},{"$f":"IF(B758=\"\",\"\",SUMIF(Einnahmen!B:B,B758,Einnahmen!A:A))","v":""}]
[null,{"$f":"IF(Konfiguration!B750=\"\",\"\",Konfiguration!B750)","v":""},null,null,null,{"$f":"IF(Konfiguration!B750=\"\",\"\",Konfiguration!C750)","v":""},{"$f":"IF(Konfiguration!B750=\"\",\"\",Konfiguration!D750)","v":""},null,null,null,{"$f":"IF(B759=\"\",\"\",SUMIF(Ausgaben!B:B,B759,Ausgaben!A:A))","v":""},{"$f":"IF(B759=\"\",\"\",SUMIF(Einnahmen!B:B,B759,Einnahmen!A:A))","v":""}]
[null,{"$f":"IF(Konfiguration!B751=\"\",\"\",Konfiguration!B751)","v":""},null,null,null,{"$f":"IF(Konfiguration!B751=\"\",\"\",Konfiguration!C751)","v":""},{"$f":"IF(Konfiguration!B751=\"\",\"\",Konfiguration!D751)","v":""},null,null,null,{"$f":"IF(B760=\"\",\"\",SUMIF(Ausgaben!B:B,B760,Ausgaben!A:A))","v":""},{"$f":"IF(B760=\"\",\"\",SUMIF(Einnahmen!B:B,B760,Einnahmen!A:A))","v":""}]
[null,{"$f":"IF(Konfiguration!B752=\"\",\"\",Konfiguration!B752)","v":""},null,null,null,{"$f":"IF(Konfiguration!B752=\"\",\"\",Konfiguration!C752)","v":""},{"$f":"IF(Konfiguration!B752=\"\",\"\",Konfiguration!D752)","v":""},null,null,null,{"$f":"IF(B761=\"\",\"\",SUMIF(Ausgaben!B:B,B761,Ausgaben!A:A))","v":""},{"$f":"IF(B761=\"\",\"\",SUMIF(Einnahmen!B:B,B761,Einnahmen!A:A))","v":""}]
[null,{"$f":"IF(Konfiguration!B753=\"\",\"\",Konfiguration!B753)","v":""},null,null,null,{"$f":"IF(Konfiguration!B753=\"\",\"\",Konfiguration!C753)","v":""},{"$f":"IF(Konfiguration!B753=\"\",\"\",Konfiguration!D753)","v":""},null,null,null,{"$f":"IF(B762=\"\",\"\",SUMIF(Ausgaben!B:B,B762,Ausgaben!A:A))","v":""},{"$f":"IF(B762=\"\",\"\",SUMIF(Einnahmen!B:B,B762,Einnahmen!A:A))","v":""}]
[null,{"$f":"IF(Konfiguration!B754=\"\",\"\",Konfiguration!B754)","v":""},null,null,null,{"$f":"IF(Konfiguration!B754=\"\",\"\",Konfiguration!C754)","v":""},{"$f":"IF(Konfiguration!B754=\"\",\"\",Konfiguration!D754)","v":""},null,null,null,{"$f":"IF(B763=\"\",\"\",SUMIF(Ausgaben!B:B,B763,Ausgaben!A:A))","v":""},{"$f":"IF(B763=\"\",\"\",SUMIF(Einnahmen!B:B,B763,Einnahmen!A:A))","v":""}]
[null,{"$f":"IF(Konfiguration!B755=\"\",\"\",Konfiguration!B755)","v":""},null,null,null,{"$f":"IF(Konfiguration!B755=\"\",\"\",Konfiguration!C755)","v":""},{"$f":"IF(Konfiguration!B755=\"\",\"\",Konfiguration!D755)","v":""},null,null,null,{"$f":"IF(B764=\"\",\"\",SUMIF(Ausgaben!B:B,B764,Ausgaben!A:A))","v":""},{"$f":"IF(B764=\"\",\"\",SUMIF(Einnahmen!B:B,B764,Einnahmen!A:A))","v":""}]
[null,{"$f":"IF(Konfiguration!B756=\"\",\"\",Konfiguration!B756)","v":""},null,null,null,{"$f":"IF(Konfiguration!B756=\"\",\"\",Konfiguration!C756)","v":""},{"$f":"IF(Konfiguration!B756=\"\",\"\",Konfiguration!D756)","v":""},null,null,null,{"$f":"IF(B765=\"\",\"\",SUMIF(Ausgaben!B:B,B765,Ausgaben!A:A))","v":""},{"$f":"IF(B765=\"\",\"\",SUMIF(Einnahmen!B:B,B765,Einnahmen!A:A))","v":""}]
[null,{"$f":"IF(Konfiguration!B757=\"\",\"\",Konfiguration!B757)","v":""},null,null,null,{"$f":"IF(Konfiguration!B757=\"\",\"\",Konfiguration!C757)","v":""},{"$f":"IF(Konfiguration!B757=\"\",\"\",Konfiguration!D757)","v":""},null,null,null,{"$f":"IF(B766=\"\",\"\",SUMIF(Ausgaben!B:B,B766,Ausgaben!A:A))","v":""},{"$f":"IF(B766=\"\",\"\",SUMIF(Einnahmen!B:B,B766,Einnahmen!A:A))","v":""}]
[null,{"$f":"IF(Konfiguration!B758=\"\",\"\",Konfiguration!B758)","v":""},null,null,null,{"$f":"IF(Konfiguration!B758=\"\",\"\",Konfiguration!C758)","v":""},{"$f":"IF(Konfiguration!B758=\"\",\"\",Konfiguration!D758)","v":""},null,null,null,{"$f":"IF(B767=\"\",\"\",SUMIF(Ausgaben!B:B,B767,Ausgaben!A:A))","v":""},{"$f":"IF(B767=\"\",\"\",SUMIF(Einnahmen!B:B,B767,Einnahmen!A:A))","v":""}]
[null,{"$f":"IF(Konfiguration!B759=\"\",\"\",Konfiguration!B759)","v":""},null,null,null,{"$f":"IF(Konfiguration!B759=\"\",\"\",Konfiguration!C759)","v":""},{"$f":"IF(Konfiguration!B759=\"\",\"\",Konfiguration!D759)","v":""},null,null,null,{"$f":"IF(B768=\"\",\"\",SUMIF(Ausgaben!B:B,B768,Ausgaben!A:A))","v":""},{"$f":"IF(B768=\"\",\"\",SUMIF(Einnahmen!B:B,B768,Einnahmen!A:A))","v":""}]
[null,{"$f":"IF(Konfiguration!B760=\"\",\"\",Konfiguration!B760)","v":""},null,null,null,{"$f":"IF(Konfiguration!B760=\"\",\"\",Konfiguration!C760)","v":""},{"$f":"IF(Konfiguration!B760=\"\",\"\",Konfiguration!D760)","v":""},null,null,null,{"$f":"IF(B769=\"\",\"\",SUMIF(Ausgaben!B:B,B769,Ausgaben!A:A))","v":""},{"$f":"IF(B769=\"\",\"\",SUMIF(Einnahmen!B:B,B769,Einnahmen!A:A))","v":""}]
[null,{"$f":"IF(Konfiguration!B761=\"\",\"\",Konfiguration!B761)","v":""},null,null,null,{"$f":"IF(Konfiguration!B761=\"\",\"\",Konfiguration!C761)","v":""},{"$f":"IF(Konfiguration!B761=\"\",\"\",Konfiguration!D761)","v":""},null,null,null,{"$f":"IF(B770=\"\",\"\",SUMIF(Ausgaben!B:B,B770,Ausgaben!A:A))","v":""},{"$f":"IF(B770=\"\",\"\",SUMIF(Einnahmen!B:B,B770,Einnahmen!A:A))","v":""}]
[null,{"$f":"IF(Konfiguration!B762=\"\",\"\",Konfiguration!B762)","v":""},null,null,null,{"$f":"IF(Konfiguration!B762=\"\",\"\",Konfiguration!C762)","v":""},{"$f":"IF(Konfiguration!B762=\"\",\"\",Konfiguration!D762)","v":""},null,null,null,{"$f":"IF(B771=\"\",\"\",SUMIF(Ausgaben!B:B,B771,Ausgaben!A:A))","v":""},{"$f":"IF(B771=\"\",\"\",SUMIF(Einnahmen!B:B,B771,Einnahmen!A:A))","v":""}]
[null,{"$f":"IF(Konfiguration!B763=\"\",\"\",Konfiguration!B763)","v":""},null,null,null,{"$f":"IF(Konfiguration!B763=\"\",\"\",Konfiguration!C763)","v":""},{"$f":"IF(Konfiguration!B763=\"\",\"\",Konfiguration!D763)","v":""},null,null,null,{"$f":"IF(B772=\"\",\"\",SUMIF(Ausgaben!B:B,B772,Ausgaben!A:A))","v":""},{"$f":"IF(B772=\"\",\"\",SUMIF(Einnahmen!B:B,B772,Einnahmen!A:A))","v":""}]
[null,{"$f":"IF(Konfiguration!B764=\"\",\"\",Konfiguration!B764)","v":""},null,null,null,{"$f":"IF(Konfiguration!B764=\"\",\"\",Konfiguration!C764)","v":""},{"$f":"IF(Konfiguration!B764=\"\",\"\",Konfiguration!D764)","v":""},null,null,null,{"$f":"IF(B773=\"\",\"\",SUMIF(Ausgaben!B:B,B773,Ausgaben!A:A))","v":""},{"$f":"IF(B773=\"\",\"\",SUMIF(Einnahmen!B:B,B773,Einnahmen!A:A))","v":""}]
[null,{"$f":"IF(Konfiguration!B765=\"\",\"\",Konfiguration!B765)","v":""},null,null,null,{"$f":"IF(Konfiguration!B765=\"\",\"\",Konfiguration!C765)","v":""},{"$f":"IF(Konfiguration!B765=\"\",\"\",Konfiguration!D765)","v":""},null,null,null,{"$f":"IF(B774=\"\",\"\",SUMIF(Ausgaben!B:B,B774,Ausgaben!A:A))","v":""},{"$f":"IF(B774=\"\",\"\",SUMIF(Einnahmen!B:B,B774,Einnahmen!A:A))","v":""}]
[null,{"$f":"IF(Konfiguration!B766=\"\",\"\",Konfiguration!B766)","v":""},null,null,null,{"$f":"IF(Konfiguration!B766=\"\",\"\",Konfiguration!C766)","v":""},{"$f":"IF(Konfiguration!B766=\"\",\"\",Konfiguration!D766)","v":""},null,null,null,{"$f":"IF(B775=\"\",\"\",SUMIF(Ausgaben!B:B,B775,Ausgaben!A:A))","v":""},{"$f":"IF(B775=\"\",\"\",SUMIF(Einnahmen!B:B,B775,Einnahmen!A:A))","v":""}]
[null,{"$f":"IF(Konfiguration!B767=\"\",\"\",Konfiguration!B767)","v":""},null,null,null,{"$f":"IF(Konfiguration!B767=\"\",\"\",Konfiguration!C767)","v":""},{"$f":"IF(Konfiguration!B767=\"\",\"\",Konfiguration!D767)","v":""},null,null,null,{"$f":"IF(B776=\"\",\"\",SUMIF(Ausgaben!B:B,B776,Ausgaben!A:A))","v":""},{"$f":"IF(B776=\"\",\"\",SUMIF(Einnahmen!B:B,B776,Einnahmen!A:A))","v":""}]
[null,{"$f":"IF(Konfiguration!B768=\"\",\"\",Konfiguration!B768)","v":""},null,null,null,{"$f":"IF(Konfiguration!B768=\"\",\"\",Konfiguration!C768)","v":""},{"$f":"IF(Konfiguration!B768=\"\",\"\",Konfiguration!D768)","v":""},null,null,null,{"$f":"IF(B777=\"\",\"\",SUMIF(Ausgaben!B:B,B777,Ausgaben!A:A))","v":""},{"$f":"IF(B777=\"\",\"\",SUMIF(Einnahmen!B:B,B777,Einnahmen!A:A))","v":""}]
[null,{"$f":"IF(Konfiguration!B769=\"\",\"\",Konfiguration!B769)","v":""},null,null,null,{"$f":"IF(Konfiguration!B769=\"\",\"\",Konfiguration!C769)","v":""},{"$f":"IF(Konfiguration!B769=\"\",\"\",Konfiguration!D769)","v":""},null,null,null,{"$f":"IF(B778=\"\",\"\",SUMIF(Ausgaben!B:B,B778,Ausgaben!A:A))","v":""},{"$f":"IF(B778=\"\",\"\",SUMIF(Einnahmen!B:B,B778,Einnahmen!A:A))","v":""}]
[null,{"$f":"IF(Konfiguration!B770=\"\",\"\",Konfiguration!B770)","v":""},null,null,null,{"$f":"IF(Konfiguration!B770=\"\",\"\",Konfiguration!C770)","v":""},{"$f":"IF(Konfiguration!B770=\"\",\"\",Konfiguration!D770)","v":""},null,null,null,{"$f":"IF(B779=\"\",\"\",SUMIF(Ausgaben!B:B,B779,Ausgaben!A:A))","v":""},{"$f":"IF(B779=\"\",\"\",SUMIF(Einnahmen!B:B,B779,Einnahmen!A:A))","v":""}]
[null,{"$f":"IF(Konfiguration!B771=\"\",\"\",Konfiguration!B771)","v":""},null,null,null,{"$f":"IF(Konfiguration!B771=\"\",\"\",Konfiguration!C771)","v":""},{"$f":"IF(Konfiguration!B771=\"\",\"\",Konfiguration!D771)","v":""},null,null,null,{"$f":"IF(B780=\"\",\"\",SUMIF(Ausgaben!B:B,B780,Ausgaben!A:A))","v":""},{"$f":"IF(B780=\"\",\"\",SUMIF(Einnahmen!B:B,B780,Einnahmen!A:A))","v":""}]
[null,{"$f":"IF(Konfiguration!B772=\"\",\"\",Konfiguration!B772)","v":""},null,null,null,{"$f":"IF(Konfiguration!B772=\"\",\"\",Konfiguration!C772)","v":""},{"$f":"IF(Konfiguration!B772=\"\",\"\",Konfiguration!D772)","v":""},null,null,null,{"$f":"IF(B781=\"\",\"\",SUMIF(Ausgaben!B:B,B781,Ausgaben!A:A))","v":""},{"$f":"IF(B781=\"\",\"\",SUMIF(Einnahmen!B:B,B781,Einnahmen!A:A))","v":""}]
[null,{"$f":"IF(Konfiguration!B773=\"\",\"\",Konfiguration!B773)","v":""},null,null,null,{"$f":"IF(Konfiguration!B773=\"\",\"\",Konfiguration!C773)","v":""},{"$f":"IF(Konfiguration!B773=\"\",\"\",Konfiguration!D773)","v":""},null,null,null,{"$f":"IF(B782=\"\",\"\",SUMIF(Ausgaben!B:B,B782,Ausgaben!A:A))","v":""},{"$f":"IF(B782=\"\",\"\",SUMIF(Einnahmen!B:B,B782,Einnahmen!A:A))","v":""}]
[null,{"$f":"IF(Konfiguration!B774=\"\",\"\",Konfiguration!B774)","v":""},null,null,null,{"$f":"IF(Konfiguration!B774=\"\",\"\",Konfiguration!C774)","v":""},{"$f":"IF(Konfiguration!B774=\"\",\"\",Konfiguration!D774)","v":""},null,null,null,{"$f":"IF(B783=\"\",\"\",SUMIF(Ausgaben!B:B,B783,Ausgaben!A:A))","v":""},{"$f":"IF(B783=\"\",\"\",SUMIF(Einnahmen!B:B,B783,Einnahmen!A:A))","v":""}]
[null,{"$f":"IF(Konfiguration!B775=\"\",\"\",Konfiguration!B775)","v":""},null,null,null,{"$f":"IF(Konfiguration!B775=\"\",\"\",Konfiguration!C775)","v":""},{"$f":"IF(Konfiguration!B775=\"\",\"\",Konfiguration!D775)","v":""},null,null,null,{"$f":"IF(B784=\"\",\"\",SUMIF(Ausgaben!B:B,B784,Ausgaben!A:A))","v":""},{"$f":"IF(B784=\"\",\"\",SUMIF(Einnahmen!B:B,B784,Einnahmen!A:A))","v":""}]
[null,{"$f":"IF(Konfiguration!B776=\"\",\"\",Konfiguration!B776)","v":""},null,null,null,{"$f":"IF(Konfiguration!B776=\"\",\"\",Konfiguration!C776)","v":""},{"$f":"IF(Konfiguration!B776=\"\",\"\",Konfiguration!D776)","v":""},null,null,null,{"$f":"IF(B785=\"\",\"\",SUMIF(Ausgaben!B:B,B785,Ausgaben!A:A))","v":""},{"$f":"IF(B785=\"\",\"\",SUMIF(Einnahmen!B:B,B785,Einnahmen!A:A))","v":""}]
[null,{"$f":"IF(Konfiguration!B777=\"\",\"\",Konfiguration!B777)","v":""},null,null,null,{"$f":"IF(Konfiguration!B777=\"\",\"\",Konfiguration!C777)","v":""},{"$f":"IF(Konfiguration!B777=\"\",\"\",Konfiguration!D777)","v":""},null,null,null,{"$f":"IF(B786=\"\",\"\",SUMIF(Ausgaben!B:B,B786,Ausgaben!A:A))","v":""},{"$f":"IF(B786=\"\",\"\",SUMIF(Einnahmen!B:B,B786,Einnahmen!A:A))","v":""}]
[null,{"$f":"IF(Konfiguration!B778=\"\",\"\",Konfiguration!B778)","v":""},null,null,null,{"$f":"IF(Konfiguration!B778=\"\",\"\",Konfiguration!C778)","v":""},{"$f":"IF(Konfiguration!B778=\"\",\"\",Konfiguration!D778)","v":""},null,null,null,{"$f":"IF(B787=\"\",\"\",SUMIF(Ausgaben!B:B,B787,Ausgaben!A:A))","v":""},{"$f":"IF(B787=\"\",\"\",SUMIF(Einnahmen!B:B,B787,Einnahmen!A:A))","v":""}]
[null,{"$f":"IF(Konfiguration!B779=\"\",\"\",Konfiguration!B779)","v":""},null,null,null,{"$f":"IF(Konfiguration!B779=\"\",\"\",Konfiguration!C779)","v":""},{"$f":"IF(Konfiguration!B779=\"\",\"\",Konfiguration!D779)","v":""},null,null,null,{"$f":"IF(B788=\"\",\"\",SUMIF(Ausgaben!B:B,B788,Ausgaben!A:A))","v":""},{"$f":"IF(B788=\"\",\"\",SUMIF(Einnahmen!B:B,B788,Einnahmen!A:A))","v":""}]
[null,{"$f":"IF(Konfiguration!B780=\"\",\"\",Konfiguration!B780)","v":""},null,null,null,{"$f":"IF(Konfiguration!B780=\"\",\"\",Konfiguration!C780)","v":""},{"$f":"IF(Konfiguration!B780=\"\",\"\",Konfiguration!D780)","v":""},null,null,null,{"$f":"IF(B789=\"\",\"\",SUMIF(Ausgaben!B:B,B789,Ausgaben!A:A))","v":""},{"$f":"IF(B789=\"\",\"\",SUMIF(Einnahmen!B:B,B789,Einnahmen!A:A))","v":""}]
[null,{"$f":"IF(Konfiguration!B781=\"\",\"\",Konfiguration!B781)","v":""},null,null,null,{"$f":"IF(Konfiguration!B781=\"\",\"\",Konfiguration!C781)","v":""},{"$f":"IF(Konfiguration!B781=\"\",\"\",Konfiguration!D781)","v":""},null,null,null,{"$f":"IF(B790=\"\",\"\",SUMIF(Ausgaben!B:B,B790,Ausgaben!A:A))","v":""},{"$f":"IF(B790=\"\",\"\",SUMIF(Einnahmen!B:B,B790,Einnahmen!A:A))","v":""}]
[null,{"$f":"IF(Konfiguration!B782=\"\",\"\",Konfiguration!B782)","v":""},null,null,null,{"$f":"IF(Konfiguration!B782=\"\",\"\",Konfiguration!C782)","v":""},{"$f":"IF(Konfiguration!B782=\"\",\"\",Konfiguration!D782)","v":""},null,null,null,{"$f":"IF(B791=\"\",\"\",SUMIF(Ausgaben!B:B,B791,Ausgaben!A:A))","v":""},{"$f":"IF(B791=\"\",\"\",SUMIF(Einnahmen!B:B,B791,Einnahmen!A:A))","v":""}]
[null,{"$f":"IF(Konfiguration!B783=\"\",\"\",Konfiguration!B783)","v":""},null,null,null,{"$f":"IF(Konfiguration!B783=\"\",\"\",Konfiguration!C783)","v":""},{"$f":"IF(Konfiguration!B783=\"\",\"\",Konfiguration!D783)","v":""},null,null,null,{"$f":"IF(B792=\"\",\"\",SUMIF(Ausgaben!B:B,B792,Ausgaben!A:A))","v":""},{"$f":"IF(B792=\"\",\"\",SUMIF(Einnahmen!B:B,B792,Einnahmen!A:A))","v":""}]
[null,{"$f":"IF(Konfiguration!B784=\"\",\"\",Konfiguration!B784)","v":""},null,null,null,{"$f":"IF(Konfiguration!B784=\"\",\"\",Konfiguration!C784)","v":""},{"$f":"IF(Konfiguration!B784=\"\",\"\",Konfiguration!D784)","v":""},null,null,null,{"$f":"IF(B793=\"\",\"\",SUMIF(Ausgaben!B:B,B793,Ausgaben!A:A))","v":""},{"$f":"IF(B793=\"\",\"\",SUMIF(Einnahmen!B:B,B793,Einnahmen!A:A))","v":""}]
[null,{"$f":"IF(Konfiguration!B785=\"\",\"\",Konfiguration!B785)","v":""},null,null,null,{"$f":"IF(Konfiguration!B785=\"\",\"\",Konfiguration!C785)","v":""},{"$f":"IF(Konfiguration!B785=\"\",\"\",Konfiguration!D785)","v":""},null,null,null,{"$f":"IF(B794=\"\",\"\",SUMIF(Ausgaben!B:B,B794,Ausgaben!A:A))","v":""},{"$f":"IF(B794=\"\",\"\",SUMIF(Einnahmen!B:B,B794,Einnahmen!A:A))","v":""}]
[null,{"$f":"IF(Konfiguration!B786=\"\",\"\",Konfiguration!B786)","v":""},null,null,null,{"$f":"IF(Konfiguration!B786=\"\",\"\",Konfiguration!C786)","v":""},{"$f":"IF(Konfiguration!B786=\"\",\"\",Konfiguration!D786)","v":""},null,null,null,{"$f":"IF(B795=\"\",\"\",SUMIF(Ausgaben!B:B,B795,Ausgaben!A:A))","v":""},{"$f":"IF(B795=\"\",\"\",SUMIF(Einnahmen!B:B,B795,Einnahmen!A:A))","v":""}]
[null,{"$f":"IF(Konfiguration!B787=\"\",\"\",Konfiguration!B787)","v":""},null,null,null,{"$f":"IF(Konfiguration!B787=\"\",\"\",Konfiguration!C787)","v":""},{"$f":"IF(Konfiguration!B787=\"\",\"\",Konfiguration!D787)","v":""},null,null,null,{"$f":"IF(B796=\"\",\"\",SUMIF(Ausgaben!B:B,B796,Ausgaben!A:A))","v":""},{"$f":"IF(B796=\"\",\"\",SUMIF(Einnahmen!B:B,B796,Einnahmen!A:A))","v":""}]
[null,{"$f":"IF(Konfiguration!B788=\"\",\"\",Konfiguration!B788)","v":""},null,null,null,{"$f":"IF(Konfiguration!B788=\"\",\"\",Konfiguration!C788)","v":""},{"$f":"IF(Konfiguration!B788=\"\",\"\",Konfiguration!D788)","v":""},null,null,null,{"$f":"IF(B797=\"\",\"\",SUMIF(Ausgaben!B:B,B797,Ausgaben!A:A))","v":""},{"$f":"IF(B797=\"\",\"\",SUMIF(Einnahmen!B:B,B797,Einnahmen!A:A))","v":""}]
[null,{"$f":"IF(Konfiguration!B789=\"\",\"\",Konfiguration!B789)","v":""},null,null,null,{"$f":"IF(Konfiguration!B789=\"\",\"\",Konfiguration!C789)","v":""},{"$f":"IF(Konfiguration!B789=\"\",\"\",Konfiguration!D789)","v":""},null,null,null,{"$f":"IF(B798=\"\",\"\",SUMIF(Ausgaben!B:B,B798,Ausgaben!A:A))","v":""},{"$f":"IF(B798=\"\",\"\",SUMIF(Einnahmen!B:B,B798,Einnahmen!A:A))","v":""}]
[null,{"$f":"IF(Konfiguration!B790=\"\",\"\",Konfiguration!B790)","v":""},null,null,null,{"$f":"IF(Konfiguration!B790=\"\",\"\",Konfiguration!C790)","v":""},{"$f":"IF(Konfiguration!B790=\"\",\"\",Konfiguration!D790)","v":""},null,null,null,{"$f":"IF(B799=\"\",\"\",SUMIF(Ausgaben!B:B,B799,Ausgaben!A:A))","v":""},{"$f":"IF(B799=\"\",\"\",SUMIF(Einnahmen!B:B,B799,Einnahmen!A:A))","v":""}]
[null,{"$f":"IF(Konfiguration!B791=\"\",\"\",Konfiguration!B791)","v":""},null,null,null,{"$f":"IF(Konfiguration!B791=\"\",\"\",Konfiguration!C791)","v":""},{"$f":"IF(Konfiguration!B791=\"\",\"\",Konfiguration!D791)","v":""},null,null,null,{"$f":"IF(B800=\"\",\"\",SUMIF(Ausgaben!B:B,B800,Ausgaben!A:A))","v":""},{"$f":"IF(B800=\"\",\"\",SUMIF(Einnahmen!B:B,B800,Einnahmen!A:A))","v":""}]
[null,{"$f":"IF(Konfiguration!B792=\"\",\"\",Konfiguration!B792)","v":""},null,null,null,{"$f":"IF(Konfiguration!B792=\"\",\"\",Konfiguration!C792)","v":""},{"$f":"IF(Konfiguration!B792=\"\",\"\",Konfiguration!D792)","v":""},null,null,null,{"$f":"IF(B801=\"\",\"\",SUMIF(Ausgaben!B:B,B801,Ausgaben!A:A))","v":""},{"$f":"IF(B801=\"\",\"\",SUMIF(Einnahmen!B:B,B801,Einnahmen!A:A))","v":""}]
[null,{"$f":"IF(Konfiguration!B793=\"\",\"\",Konfiguration!B793)","v":""},null,null,null,{"$f":"IF(Konfiguration!B793=\"\",\"\",Konfiguration!C793)","v":""},{"$f":"IF(Konfiguration!B793=\"\",\"\",Konfiguration!D793)","v":""},null,null,null,{"$f":"IF(B802=\"\",\"\",SUMIF(Ausgaben!B:B,B802,Ausgaben!A:A))","v":""},{"$f":"IF(B802=\"\",\"\",SUMIF(Einnahmen!B:B,B802,Einnahmen!A:A))","v":""}]
[null,{"$f":"IF(Konfiguration!B794=\"\",\"\",Konfiguration!B794)","v":""},null,null,null,{"$f":"IF(Konfiguration!B794=\"\",\"\",Konfiguration!C794)","v":""},{"$f":"IF(Konfiguration!B794=\"\",\"\",Konfiguration!D794)","v":""},null,null,null,{"$f":"IF(B803=\"\",\"\",SUMIF(Ausgaben!B:B,B803,Ausgaben!A:A))","v":""},{"$f":"IF(B803=\"\",\"\",SUMIF(Einnahmen!B:B,B803,Einnahmen!A:A))","v":""}]
[null,{"$f":"IF(Konfiguration!B795=\"\",\"\",Konfiguration!B795)","v":""},null,null,null,{"$f":"IF(Konfiguration!B795=\"\",\"\",Konfiguration!C795)","v":""},{"$f":"IF(Konfiguration!B795=\"\",\"\",Konfiguration!D795)","v":""},null,null,null,{"$f":"IF(B804=\"\",\"\",SUMIF(Ausgaben!B:B,B804,Ausgaben!A:A))","v":""},{"$f":"IF(B804=\"\",\"\",SUMIF(Einnahmen!B:B,B804,Einnahmen!A:A))","v":""}]
[null,{"$f":"IF(Konfiguration!B796=\"\",\"\",Konfiguration!B796)","v":""},null,null,null,{"$f":"IF(Konfiguration!B796=\"\",\"\",Konfiguration!C796)","v":""},{"$f":"IF(Konfiguration!B796=\"\",\"\",Konfiguration!D796)","v":""},null,null,null,{"$f":"IF(B805=\"\",\"\",SUMIF(Ausgaben!B:B,B805,Ausgaben!A:A))","v":""},{"$f":"IF(B805=\"\",\"\",SUMIF(Einnahmen!B:B,B805,Einnahmen!A:A))","v":""}]
[null,{"$f":"IF(Konfiguration!B797=\"\",\"\",Konfiguration!B797)","v":""},null,null,null,{"$f":"IF(Konfiguration!B797=\"\",\"\",Konfiguration!C797)","v":""},{"$f":"IF(Konfiguration!B797=\"\",\"\",Konfiguration!D797)","v":""},null,null,null,{"$f":"IF(B806=\"\",\"\",SUMIF(Ausgaben!B:B,B806,Ausgaben!A:A))","v":""},{"$f":"IF(B806=\"\",\"\",SUMIF(Einnahmen!B:B,B806,Einnahmen!A:A))","v":""}]
[null,{"$f":"IF(Konfiguration!B798=\"\",\"\",Konfiguration!B798)","v":""},null,null,null,{"$f":"IF(Konfiguration!B798=\"\",\"\",Konfiguration!C798)","v":""},{"$f":"IF(Konfiguration!B798=\"\",\"\",Konfiguration!D798)","v":""},null,null,null,{"$f":"IF(B807=\"\",\"\",SUMIF(Ausgaben!B:B,B807,Ausgaben!A:A))","v":""},{"$f":"IF(B807=\"\",\"\",SUMIF(Einnahmen!B:B,B807,Einnahmen!A:A))","v":""}]
[null,{"$f":"IF(Konfiguration!B799=\"\",\"\",Konfiguration!B799)","v":""},null,null,null,{"$f":"IF(Konfiguration!B799=\"\",\"\",Konfiguration!C799)","v":""},{"$f":"IF(Konfiguration!B799=\"\",\"\",Konfiguration!D799)","v":""},null,null,null,{"$f":"IF(B808=\"\",\"\",SUMIF(Ausgaben!B:B,B808,Ausgaben!A:A))","v":""},{"$f":"IF(B808=\"\",\"\",SUMIF(Einnahmen!B:B,B808,Einnahmen!A:A))","v":""}]
[null,{"$f":"IF(Konfiguration!B800=\"\",\"\",Konfiguration!B800)","v":""},null,null,null,{"$f":"IF(Konfiguration!B800=\"\",\"\",Konfiguration!C800)","v":""},{"$f":"IF(Konfiguration!B800=\"\",\"\",Konfiguration!D800)","v":""},null,null,null,{"$f":"IF(B809=\"\",\"\",SUMIF(Ausgaben!B:B,B809,Ausgaben!A:A))","v":""},{"$f":"IF(B809=\"\",\"\",SUMIF(Einnahmen!B:B,B809,Einnahmen!A:A))","v":""}]
[null,{"$f":"IF(Konfiguration!B801=\"\",\"\",Konfiguration!B801)","v":""},null,null,null,{"$f":"IF(Konfiguration!B801=\"\",\"\",Konfiguration!C801)","v":""},{"$f":"IF(Konfiguration!B801=\"\",\"\",Konfiguration!D801)","v":""},null,null,null,{"$f":"IF(B810=\"\",\"\",SUMIF(Ausgaben!B:B,B810,Ausgaben!A:A))","v":""},{"$f":"IF(B810=\"\",\"\",SUMIF(Einnahmen!B:B,B810,Einnahmen!A:A))","v":""}]
[null,{"$f":"IF(Konfiguration!B802=\"\",\"\",Konfiguration!B802)","v":""},null,null,null,{"$f":"IF(Konfiguration!B802=\"\",\"\",Konfiguration!C802)","v":""},{"$f":"IF(Konfiguration!B802=\"\",\"\",Konfiguration!D802)","v":""},null,null,null,{"$f":"IF(B811=\"\",\"\",SUMIF(Ausgaben!B:B,B811,Ausgaben!A:A))","v":""},{"$f":"IF(B811=\"\",\"\",SUMIF(Einnahmen!B:B,B811,Einnahmen!A:A))","v":""}]
[null,{"$f":"IF(Konfiguration!B803=\"\",\"\",Konfiguration!B803)","v":""},null,null,null,{"$f":"IF(Konfiguration!B803=\"\",\"\",Konfiguration!C803)","v":""},{"$f":"IF(Konfiguration!B803=\"\",\"\",Konfiguration!D803)","v":""},null,null,null,{"$f":"IF(B812=\"\",\"\",SUMIF(Ausgaben!B:B,B812,Ausgaben!A:A))","v":""},{"$f":"IF(B812=\"\",\"\",SUMIF(Einnahmen!B:B,B812,Einnahmen!A:A))","v":""}]
[null,{"$f":"IF(Konfiguration!B804=\"\",\"\",Konfiguration!B804)","v":""},null,null,null,{"$f":"IF(Konfiguration!B804=\"\",\"\",Konfiguration!C804)","v":""},{"$f":"IF(Konfiguration!B804=\"\",\"\",Konfiguration!D804)","v":""},null,null,null,{"$f":"IF(B813=\"\",\"\",SUMIF(Ausgaben!B:B,B813,Ausgaben!A:A))","v":""},{"$f":"IF(B813=\"\",\"\",SUMIF(Einnahmen!B:B,B813,Einnahmen!A:A))","v":""}]
[null,{"$f":"IF(Konfiguration!B805=\"\",\"\",Konfiguration!B805)","v":""},null,null,null,{"$f":"IF(Konfiguration!B805=\"\",\"\",Konfiguration!C805)","v":""},{"$f":"IF(Konfiguration!B805=\"\",\"\",Konfiguration!D805)","v":""},null,null,null,{"$f":"IF(B814=\"\",\"\",SUMIF(Ausgaben!B:B,B814,Ausgaben!A:A))","v":""},{"$f":"IF(B814=\"\",\"\",SUMIF(Einnahmen!B:B,B814,Einnahmen!A:A))","v":""}]
[null,{"$f":"IF(Konfiguration!B806=\"\",\"\",Konfiguration!B806)","v":""},null,null,null,{"$f":"IF(Konfiguration!B806=\"\",\"\",Konfiguration!C806)","v":""},{"$f":"IF(Konfiguration!B806=\"\",\"\",Konfiguration!D806)","v":""},null,null,null,{"$f":"IF(B815=\"\",\"\",SUMIF(Ausgaben!B:B,B815,Ausgaben!A:A))","v":""},{"$f":"IF(B815=\"\",\"\",SUMIF(Einnahmen!B:B,B815,Einnahmen!A:A))","v":""}]
[null,{"$f":"IF(Konfiguration!B807=\"\",\"\",Konfiguration!B807)","v":""},null,null,null,{"$f":"IF(Konfiguration!B807=\"\",\"\",Konfiguration!C807)","v":""},{"$f":"IF(Konfiguration!B807=\"\",\"\",Konfiguration!D807)","v":""},null,null,null,{"$f":"IF(B816=\"\",\"\",SUMIF(Ausgaben!B:B,B816,Ausgaben!A:A))","v":""},{"$f":"IF(B816=\"\",\"\",SUMIF(Einnahmen!B:B,B816,Einnahmen!A:A))","v":""}]
[null,{"$f":"IF(Konfiguration!B808=\"\",\"\",Konfiguration!B808)","v":""},null,null,null,{"$f":"IF(Konfiguration!B808=\"\",\"\",Konfiguration!C808)","v":""},{"$f":"IF(Konfiguration!B808=\"\",\"\",Konfiguration!D808)","v":""},null,null,null,{"$f":"IF(B817=\"\",\"\",SUMIF(Ausgaben!B:B,B817,Ausgaben!A:A))","v":""},{"$f":"IF(B817=\"\",\"\",SUMIF(Einnahmen!B:B,B817,Einnahmen!A:A))","v":""}]
[null,{"$f":"IF(Konfiguration!B809=\"\",\"\",Konfiguration!B809)","v":""},null,null,null,{"$f":"IF(Konfiguration!B809=\"\",\"\",Konfiguration!C809)","v":""},{"$f":"IF(Konfiguration!B809=\"\",\"\",Konfiguration!D809)","v":""},null,null,null,{"$f":"IF(B818=\"\",\"\",SUMIF(Ausgaben!B:B,B818,Ausgaben!A:A))","v":""},{"$f":"IF(B818=\"\",\"\",SUMIF(Einnahmen!B:B,B818,Einnahmen!A:A))","v":""}]
[null,{"$f":"IF(Konfiguration!B810=\"\",\"\",Konfiguration!B810)","v":""},null,null,null,{"$f":"IF(Konfiguration!B810=\"\",\"\",Konfiguration!C810)","v":""},{"$f":"IF(Konfiguration!B810=\"\",\"\",Konfiguration!D810)","v":""},null,null,null,{"$f":"IF(B819=\"\",\"\",SUMIF(Ausgaben!B:B,B819,Ausgaben!A:A))","v":""},{"$f":"IF(B819=\"\",\"\",SUMIF(Einnahmen!B:B,B819,Einnahmen!A:A))","v":""}]
[null,{"$f":"IF(Konfiguration!B811=\"\",\"\",Konfiguration!B811)","v":""},null,null,null,{"$f":"IF(Konfiguration!B811=\"\",\"\",Konfiguration!C811)","v":""},{"$f":"IF(Konfiguration!B811=\"\",\"\",Konfiguration!D811)","v":""},null,null,null,{"$f":"IF(B820=\"\",\"\",SUMIF(Ausgaben!B:B,B820,Ausgaben!A:A))","v":""},{"$f":"IF(B820=\"\",\"\",SUMIF(Einnahmen!B:B,B820,Einnahmen!A:A))","v":""}]
[null,{"$f":"IF(Konfiguration!B812=\"\",\"\",Konfiguration!B812)","v":""},null,null,null,{"$f":"IF(Konfiguration!B812=\"\",\"\",Konfiguration!C812)","v":""},{"$f":"IF(Konfiguration!B812=\"\",\"\",Konfiguration!D812)","v":""},null,null,null,{"$f":"IF(B821=\"\",\"\",SUMIF(Ausgaben!B:B,B821,Ausgaben!A:A))","v":""},{"$f":"IF(B821=\"\",\"\",SUMIF(Einnahmen!B:B,B821,Einnahmen!A:A))","v":""}]
[null,{"$f":"IF(Konfiguration!B813=\"\",\"\",Konfiguration!B813)","v":""},null,null,null,{"$f":"IF(Konfiguration!B813=\"\",\"\",Konfiguration!C813)","v":""},{"$f":"IF(Konfiguration!B813=\"\",\"\",Konfiguration!D813)","v":""},null,null,null,{"$f":"IF(B822=\"\",\"\",SUMIF(Ausgaben!B:B,B822,Ausgaben!A:A))","v":""},{"$f":"IF(B822=\"\",\"\",SUMIF(Einnahmen!B:B,B822,Einnahmen!A:A))","v":""}]
[null,{"$f":"IF(Konfiguration!B814=\"\",\"\",Konfiguration!B814)","v":""},null,null,null,{"$f":"IF(Konfiguration!B814=\"\",\"\",Konfiguration!C814)","v":""},{"$f":"IF(Konfiguration!B814=\"\",\"\",Konfiguration!D814)","v":""},null,null,null,{"$f":"IF(B823=\"\",\"\",SUMIF(Ausgaben!B:B,B823,Ausgaben!A:A))","v":""},{"$f":"IF(B823=\"\",\"\",SUMIF(Einnahmen!B:B,B823,Einnahmen!A:A))","v":""}]
[null,{"$f":"IF(Konfiguration!B815=\"\",\"\",Konfiguration!B815)","v":""},null,null,null,{"$f":"IF(Konfiguration!B815=\"\",\"\",Konfiguration!C815)","v":""},{"$f":"IF(Konfiguration!B815=\"\",\"\",Konfiguration!D815)","v":""},null,null,null,{"$f":"IF(B824=\"\",\"\",SUMIF(Ausgaben!B:B,B824,Ausgaben!A:A))","v":""},{"$f":"IF(B824=\"\",\"\",SUMIF(Einnahmen!B:B,B824,Einnahmen!A:A))","v":""}]
[null,{"$f":"IF(Konfiguration!B816=\"\",\"\",Konfiguration!B816)","v":""},null,null,null,{"$f":"IF(Konfiguration!B816=\"\",\"\",Konfiguration!C816)","v":""},{"$f":"IF(Konfiguration!B816=\"\",\"\",Konfiguration!D816)","v":""},null,null,null,{"$f":"IF(B825=\"\",\"\",SUMIF(Ausgaben!B:B,B825,Ausgaben!A:A))","v":""},{"$f":"IF(B825=\"\",\"\",SUMIF(Einnahmen!B:B,B825,Einnahmen!A:A))","v":""}]
[null,{"$f":"IF(Konfiguration!B817=\"\",\"\",Konfiguration!B817)","v":""},null,null,null,{"$f":"IF(Konfiguration!B817=\"\",\"\",Konfiguration!C817)","v":""},{"$f":"IF(Konfiguration!B817=\"\",\"\",Konfiguration!D817)","v":""},null,null,null,{"$f":"IF(B826=\"\",\"\",SUMIF(Ausgaben!B:B,B826,Ausgaben!A:A))","v":""},{"$f":"IF(B826=\"\",\"\",SUMIF(Einnahmen!B:B,B826,Einnahmen!A:A))","v":""}]
[null,{"$f":"IF(Konfiguration!B818=\"\",\"\",Konfiguration!B818)","v":""},null,null,null,{"$f":"IF(Konfiguration!B818=\"\",\"\",Konfiguration!C818)","v":""},{"$f":"IF(Konfiguration!B818=\"\",\"\",Konfiguration!D818)","v":""},null,null,null,{"$f":"IF(B827=\"\",\"\",SUMIF(Ausgaben!B:B,B827,Ausgaben!A:A))","v":""},{"$f":"IF(B827=\"\",\"\",SUMIF(Einnahmen!B:B,B827,Einnahmen!A:A))","v":""}]
[null,{"$f":"IF(Konfiguration!B819=\"\",\"\",Konfiguration!B819)","v":""},null,null,null,{"$f":"IF(Konfiguration!B819=\"\",\"\",Konfiguration!C819)","v":""},{"$f":"IF(Konfiguration!B819=\"\",\"\",Konfiguration!D819)","v":""},null,null,null,{"$f":"IF(B828=\"\",\"\",SUMIF(Ausgaben!B:B,B828,Ausgaben!A:A))","v":""},{"$f":"IF(B828=\"\",\"\",SUMIF(Einnahmen!B:B,B828,Einnahmen!A:A))","v":""}]
[null,{"$f":"IF(Konfiguration!B820=\"\",\"\",Konfiguration!B820)","v":""},null,null,null,{"$f":"IF(Konfiguration!B820=\"\",\"\",Konfiguration!C820)","v":""},{"$f":"IF(Konfiguration!B820=\"\",\"\",Konfiguration!D820)","v":""},null,null,null,{"$f":"IF(B829=\"\",\"\",SUMIF(Ausgaben!B:B,B829,Ausgaben!A:A))","v":""},{"$f":"IF(B829=\"\",\"\",SUMIF(Einnahmen!B:B,B829,Einnahmen!A:A))","v":""}]
[null,{"$f":"IF(Konfiguration!B821=\"\",\"\",Konfiguration!B821)","v":""},null,null,null,{"$f":"IF(Konfiguration!B821=\"\",\"\",Konfiguration!C821)","v":""},{"$f":"IF(Konfiguration!B821=\"\",\"\",Konfiguration!D821)","v":""},null,null,null,{"$f":"IF(B830=\"\",\"\",SUMIF(Ausgaben!B:B,B830,Ausgaben!A:A))","v":""},{"$f":"IF(B830=\"\",\"\",SUMIF(Einnahmen!B:B,B830,Einnahmen!A:A))","v":""}]
[null,{"$f":"IF(Konfiguration!B822=\"\",\"\",Konfiguration!B822)","v":""},null,null,null,{"$f":"IF(Konfiguration!B822=\"\",\"\",Konfiguration!C822)","v":""},{"$f":"IF(Konfiguration!B822=\"\",\"\",Konfiguration!D822)","v":""},null,null,null,{"$f":"IF(B831=\"\",\"\",SUMIF(Ausgaben!B:B,B831,Ausgaben!A:A))","v":""},{"$f":"IF(B831=\"\",\"\",SUMIF(Einnahmen!B:B,B831,Einnahmen!A:A))","v":""}]
[null,{"$f":"IF(Konfiguration!B823=\"\",\"\",Konfiguration!B823)","v":""},null,null,null,{"$f":"IF(Konfiguration!B823=\"\",\"\",Konfiguration!C823)","v":""},{"$f":"IF(Konfiguration!B823=\"\",\"\",Konfiguration!D823)","v":""},null,null,null,{"$f":"IF(B832=\"\",\"\",SUMIF(Ausgaben!B:B,B832,Ausgaben!A:A))","v":""},{"$f":"IF(B832=\"\",\"\",SUMIF(Einnahmen!B:B,B832,Einnahmen!A:A))","v":""}]
[null,{"$f":"IF(Konfiguration!B824=\"\",\"\",Konfiguration!B824)","v":""},null,null,null,{"$f":"IF(Konfiguration!B824=\"\",\"\",Konfiguration!C824)","v":""},{"$f":"IF(Konfiguration!B824=\"\",\"\",Konfiguration!D824)","v":""},null,null,null,{"$f":"IF(B833=\"\",\"\",SUMIF(Ausgaben!B:B,B833,Ausgaben!A:A))","v":""},{"$f":"IF(B833=\"\",\"\",SUMIF(Einnahmen!B:B,B833,Einnahmen!A:A))","v":""}]
[null,{"$f":"IF(Konfiguration!B825=\"\",\"\",Konfiguration!B825)","v":""},null,null,null,{"$f":"IF(Konfiguration!B825=\"\",\"\",Konfiguration!C825)","v":""},{"$f":"IF(Konfiguration!B825=\"\",\"\",Konfiguration!D825)","v":""},null,null,null,{"$f":"IF(B834=\"\",\"\",SUMIF(Ausgaben!B:B,B834,Ausgaben!A:A))","v":""},{"$f":"IF(B834=\"\",\"\",SUMIF(Einnahmen!B:B,B834,Einnahmen!A:A))","v":""}]
[null,{"$f":"IF(Konfiguration!B826=\"\",\"\",Konfiguration!B826)","v":""},null,null,null,{"$f":"IF(Konfiguration!B826=\"\",\"\",Konfiguration!C826)","v":""},{"$f":"IF(Konfiguration!B826=\"\",\"\",Konfiguration!D826)","v":""},null,null,null,{"$f":"IF(B835=\"\",\"\",SUMIF(Ausgaben!B:B,B835,Ausgaben!A:A))","v":""},{"$f":"IF(B835=\"\",\"\",SUMIF(Einnahmen!B:B,B835,Einnahmen!A:A))","v":""}]
[null,{"$f":"IF(Konfiguration!B827=\"\",\"\",Konfiguration!B827)","v":""},null,null,null,{"$f":"IF(Konfiguration!B827=\"\",\"\",Konfiguration!C827)","v":""},{"$f":"IF(Konfiguration!B827=\"\",\"\",Konfiguration!D827)","v":""},null,null,null,{"$f":"IF(B836=\"\",\"\",SUMIF(Ausgaben!B:B,B836,Ausgaben!A:A))","v":""},{"$f":"IF(B836=\"\",\"\",SUMIF(Einnahmen!B:B,B836,Einnahmen!A:A))","v":""}]
[null,{"$f":"IF(Konfiguration!B828=\"\",\"\",Konfiguration!B828)","v":""},null,null,null,{"$f":"IF(Konfiguration!B828=\"\",\"\",Konfiguration!C828)","v":""},{"$f":"IF(Konfiguration!B828=\"\",\"\",Konfiguration!D828)","v":""},null,null,null,{"$f":"IF(B837=\"\",\"\",SUMIF(Ausgaben!B:B,B837,Ausgaben!A:A))","v":""},{"$f":"IF(B837=\"\",\"\",SUMIF(Einnahmen!B:B,B837,Einnahmen!A:A))","v":""}]
[null,{"$f":"IF(Konfiguration!B829=\"\",\"\",Konfiguration!B829)","v":""},null,null,null,{"$f":"IF(Konfiguration!B829=\"\",\"\",Konfiguration!C829)","v":""},{"$f":"IF(Konfiguration!B829=\"\",\"\",Konfiguration!D829)","v":""},null,null,null,{"$f":"IF(B838=\"\",\"\",SUMIF(Ausgaben!B:B,B838,Ausgaben!A:A))","v":""},{"$f":"IF(B838=\"\",\"\",SUMIF(Einnahmen!B:B,B838,Einnahmen!A:A))","v":""}]
[null,{"$f":"IF(Konfiguration!B830=\"\",\"\",Konfiguration!B830)","v":""},null,null,null,{"$f":"IF(Konfiguration!B830=\"\",\"\",Konfiguration!C830)","v":""},{"$f":"IF(Konfiguration!B830=\"\",\"\",Konfiguration!D830)","v":""},null,null,null,{"$f":"IF(B839=\"\",\"\",SUMIF(Ausgaben!B:B,B839,Ausgaben!A:A))","v":""},{"$f":"IF(B839=\"\",\"\",SUMIF(Einnahmen!B:B,B839,Einnahmen!A:A))","v":""}]
[null,{"$f":"IF(Konfiguration!B831=\"\",\"\",Konfiguration!B831)","v":""},null,null,null,{"$f":"IF(Konfiguration!B831=\"\",\"\",Konfiguration!C831)","v":""},{"$f":"IF(Konfiguration!B831=\"\",\"\",Konfiguration!D831)","v":""},null,null,null,{"$f":"IF(B840=\"\",\"\",SUMIF(Ausgaben!B:B,B840,Ausgaben!A:A))","v":""},{"$f":"IF(B840=\"\",\"\",SUMIF(Einnahmen!B:B,B840,Einnahmen!A:A))","v":""}]
[null,{"$f":"IF(Konfiguration!B832=\"\",\"\",Konfiguration!B832)","v":""},null,null,null,{"$f":"IF(Konfiguration!B832=\"\",\"\",Konfiguration!C832)","v":""},{"$f":"IF(Konfiguration!B832=\"\",\"\",Konfiguration!D832)","v":""},null,null,null,{"$f":"IF(B841=\"\",\"\",SUMIF(Ausgaben!B:B,B841,Ausgaben!A:A))","v":""},{"$f":"IF(B841=\"\",\"\",SUMIF(Einnahmen!B:B,B841,Einnahmen!A:A))","v":""}]
[null,{"$f":"IF(Konfiguration!B833=\"\",\"\",Konfiguration!B833)","v":""},null,null,null,{"$f":"IF(Konfiguration!B833=\"\",\"\",Konfiguration!C833)","v":""},{"$f":"IF(Konfiguration!B833=\"\",\"\",Konfiguration!D833)","v":""},null,null,null,{"$f":"IF(B842=\"\",\"\",SUMIF(Ausgaben!B:B,B842,Ausgaben!A:A))","v":""},{"$f":"IF(B842=\"\",\"\",SUMIF(Einnahmen!B:B,B842,Einnahmen!A:A))","v":""}]
[null,{"$f":"IF(Konfiguration!B834=\"\",\"\",Konfiguration!B834)","v":""},null,null,null,{"$f":"IF(Konfiguration!B834=\"\",\"\",Konfiguration!C834)","v":""},{"$f":"IF(Konfiguration!B834=\"\",\"\",Konfiguration!D834)","v":""},null,null,null,{"$f":"IF(B843=\"\",\"\",SUMIF(Ausgaben!B:B,B843,Ausgaben!A:A))","v":""},{"$f":"IF(B843=\"\",\"\",SUMIF(Einnahmen!B:B,B843,Einnahmen!A:A))","v":""}]
[null,{"$f":"IF(Konfiguration!B835=\"\",\"\",Konfiguration!B835)","v":""},null,null,null,{"$f":"IF(Konfiguration!B835=\"\",\"\",Konfiguration!C835)","v":""},{"$f":"IF(Konfiguration!B835=\"\",\"\",Konfiguration!D835)","v":""},null,null,null,{"$f":"IF(B844=\"\",\"\",SUMIF(Ausgaben!B:B,B844,Ausgaben!A:A))","v":""},{"$f":"IF(B844=\"\",\"\",SUMIF(Einnahmen!B:B,B844,Einnahmen!A:A))","v":""}]
[null,{"$f":"IF(Konfiguration!B836=\"\",\"\",Konfiguration!B836)","v":""},null,null,null,{"$f":"IF(Konfiguration!B836=\"\",\"\",Konfiguration!C836)","v":""},{"$f":"IF(Konfiguration!B836=\"\",\"\",Konfiguration!D836)","v":""},null,null,null,{"$f":"IF(B845=\"\",\"\",SUMIF(Ausgaben!B:B,B845,Ausgaben!A:A))","v":""},{"$f":"IF(B845=\"\",\"\",SUMIF(Einnahmen!B:B,B845,Einnahmen!A:A))","v":""}]
[null,{"$f":"IF(Konfiguration!B837=\"\",\"\",Konfiguration!B837)","v":""},null,null,null,{"$f":"IF(Konfiguration!B837=\"\",\"\",Konfiguration!C837)","v":""},{"$f":"IF(Konfiguration!B837=\"\",\"\",Konfiguration!D837)","v":""},null,null,null,{"$f":"IF(B846=\"\",\"\",SUMIF(Ausgaben!B:B,B846,Ausgaben!A:A))","v":""},{"$f":"IF(B846=\"\",\"\",SUMIF(Einnahmen!B:B,B846,Einnahmen!A:A))","v":""}]
[null,{"$f":"IF(Konfiguration!B838=\"\",\"\",Konfiguration!B838)","v":""},null,null,null,{"$f":"IF(Konfiguration!B838=\"\",\"\",Konfiguration!C838)","v":""},{"$f":"IF(Konfiguration!B838=\"\",\"\",Konfiguration!D838)","v":""},null,null,null,{"$f":"IF(B847=\"\",\"\",SUMIF(Ausgaben!B:B,B847,Ausgaben!A:A))","v":""},{"$f":"IF(B847=\"\",\"\",SUMIF(Einnahmen!B:B,B847,Einnahmen!A:A))","v":""}]
[null,{"$f":"IF(Konfiguration!B839=\"\",\"\",Konfiguration!B839)","v":""},null,null,null,{"$f":"IF(Konfiguration!B839=\"\",\"\",Konfiguration!C839)","v":""},{"$f":"IF(Konfiguration!B839=\"\",\"\",Konfiguration!D839)","v":""},null,null,null,{"$f":"IF(B848=\"\",\"\",SUMIF(Ausgaben!B:B,B848,Ausgaben!A:A))","v":""},{"$f":"IF(B848=\"\",\"\",SUMIF(Einnahmen!B:B,B848,Einnahmen!A:A))","v":""}]
[null,{"$f":"IF(Konfiguration!B840=\"\",\"\",Konfiguration!B840)","v":""},null,null,null,{"$f":"IF(Konfiguration!B840=\"\",\"\",Konfiguration!C840)","v":""},{"$f":"IF(Konfiguration!B840=\"\",\"\",Konfiguration!D840)","v":""},null,null,null,{"$f":"IF(B849=\"\",\"\",SUMIF(Ausgaben!B:B,B849,Ausgaben!A:A))","v":""},{"$f":"IF(B849=\"\",\"\",SUMIF(Einnahmen!B:B,B849,Einnahmen!A:A))","v":""}]
[null,{"$f":"IF(Konfiguration!B841=\"\",\"\",Konfiguration!B841)","v":""},null,null,null,{"$f":"IF(Konfiguration!B841=\"\",\"\",Konfiguration!C841)","v":""},{"$f":"IF(Konfiguration!B841=\"\",\"\",Konfiguration!D841)","v":""},null,null,null,{"$f":"IF(B850=\"\",\"\",SUMIF(Ausgaben!B:B,B850,Ausgaben!A:A))","v":""},{"$f":"IF(B850=\"\",\"\",SUMIF(Einnahmen!B:B,B850,Einnahmen!A:A))","v":""}]
[null,{"$f":"IF(Konfiguration!B842=\"\",\"\",Konfiguration!B842)","v":""},null,null,null,{"$f":"IF(Konfiguration!B842=\"\",\"\",Konfiguration!C842)","v":""},{"$f":"IF(Konfiguration!B842=\"\",\"\",Konfiguration!D842)","v":""},null,null,null,{"$f":"IF(B851=\"\",\"\",SUMIF(Ausgaben!B:B,B851,Ausgaben!A:A))","v":""},{"$f":"IF(B851=\"\",\"\",SUMIF(Einnahmen!B:B,B851,Einnahmen!A:A))","v":""}]
[null,{"$f":"IF(Konfiguration!B843=\"\",\"\",Konfiguration!B843)","v":""},null,null,null,{"$f":"IF(Konfiguration!B843=\"\",\"\",Konfiguration!C843)","v":""},{"$f":"IF(Konfiguration!B843=\"\",\"\",Konfiguration!D843)","v":""},null,null,null,{"$f":"IF(B852=\"\",\"\",SUMIF(Ausgaben!B:B,B852,Ausgaben!A:A))","v":""},{"$f":"IF(B852=\"\",\"\",SUMIF(Einnahmen!B:B,B852,Einnahmen!A:A))","v":""}]
[null,{"$f":"IF(Konfiguration!B844=\"\",\"\",Konfiguration!B844)","v":""},null,null,null,{"$f":"IF(Konfiguration!B844=\"\",\"\",Konfiguration!C844)","v":""},{"$f":"IF(Konfiguration!B844=\"\",\"\",Konfiguration!D844)","v":""},null,null,null,{"$f":"IF(B853=\"\",\"\",SUMIF(Ausgaben!B:B,B853,Ausgaben!A:A))","v":""},{"$f":"IF(B853=\"\",\"\",SUMIF(Einnahmen!B:B,B853,Einnahmen!A:A))","v":""}]
[null,{"$f":"IF(Konfiguration!B845=\"\",\"\",Konfiguration!B845)","v":""},null,null,null,{"$f":"IF(Konfiguration!B845=\"\",\"\",Konfiguration!C845)","v":""},{"$f":"IF(Konfiguration!B845=\"\",\"\",Konfiguration!D845)","v":""},null,null,null,{"$f":"IF(B854=\"\",\"\",SUMIF(Ausgaben!B:B,B854,Ausgaben!A:A))","v":""},{"$f":"IF(B854=\"\",\"\",SUMIF(Einnahmen!B:B,B854,Einnahmen!A:A))","v":""}]
[null,{"$f":"IF(Konfiguration!B846=\"\",\"\",Konfiguration!B846)","v":""},null,null,null,{"$f":"IF(Konfiguration!B846=\"\",\"\",Konfiguration!C846)","v":""},{"$f":"IF(Konfiguration!B846=\"\",\"\",Konfiguration!D846)","v":""},null,null,null,{"$f":"IF(B855=\"\",\"\",SUMIF(Ausgaben!B:B,B855,Ausgaben!A:A))","v":""},{"$f":"IF(B855=\"\",\"\",SUMIF(Einnahmen!B:B,B855,Einnahmen!A:A))","v":""}]
[null,{"$f":"IF(Konfiguration!B847=\"\",\"\",Konfiguration!B847)","v":""},null,null,null,{"$f":"IF(Konfiguration!B847=\"\",\"\",Konfiguration!C847)","v":""},{"$f":"IF(Konfiguration!B847=\"\",\"\",Konfiguration!D847)","v":""},null,null,null,{"$f":"IF(B856=\"\",\"\",SUMIF(Ausgaben!B:B,B856,Ausgaben!A:A))","v":""},{"$f":"IF(B856=\"\",\"\",SUMIF(Einnahmen!B:B,B856,Einnahmen!A:A))","v":""}]
[null,{"$f":"IF(Konfiguration!B848=\"\",\"\",Konfiguration!B848)","v":""},null,null,null,{"$f":"IF(Konfiguration!B848=\"\",\"\",Konfiguration!C848)","v":""},{"$f":"IF(Konfiguration!B848=\"\",\"\",Konfiguration!D848)","v":""},null,null,null,{"$f":"IF(B857=\"\",\"\",SUMIF(Ausgaben!B:B,B857,Ausgaben!A:A))","v":""},{"$f":"IF(B857=\"\",\"\",SUMIF(Einnahmen!B:B,B857,Einnahmen!A:A))","v":""}]
[null,{"$f":"IF(Konfiguration!B849=\"\",\"\",Konfiguration!B849)","v":""},null,null,null,{"$f":"IF(Konfiguration!B849=\"\",\"\",Konfiguration!C849)","v":""},{"$f":"IF(Konfiguration!B849=\"\",\"\",Konfiguration!D849)","v":""},null,null,null,{"$f":"IF(B858=\"\",\"\",SUMIF(Ausgaben!B:B,B858,Ausgaben!A:A))","v":""},{"$f":"IF(B858=\"\",\"\",SUMIF(Einnahmen!B:B,B858,Einnahmen!A:A))","v":""}]
[null,{"$f":"IF(Konfiguration!B850=\"\",\"\",Konfiguration!B850)","v":""},null,null,null,{"$f":"IF(Konfiguration!B850=\"\",\"\",Konfiguration!C850)","v":""},{"$f":"IF(Konfiguration!B850=\"\",\"\",Konfiguration!D850)","v":""},null,null,null,{"$f":"IF(B859=\"\",\"\",SUMIF(Ausgaben!B:B,B859,Ausgaben!A:A))","v":""},{"$f":"IF(B859=\"\",\"\",SUMIF(Einnahmen!B:B,B859,Einnahmen!A:A))","v":""}]
[null,{"$f":"IF(Konfiguration!B851=\"\",\"\",Konfiguration!B851)","v":""},null,null,null,{"$f":"IF(Konfiguration!B851=\"\",\"\",Konfiguration!C851)","v":""},{"$f":"IF(Konfiguration!B851=\"\",\"\",Konfiguration!D851)","v":""},null,null,null,{"$f":"IF(B860=\"\",\"\",SUMIF(Ausgaben!B:B,B860,Ausgaben!A:A))","v":""}]
[null,{"$f":"IF(Konfiguration!B852=\"\",\"\",Konfiguration!B852)","v":""},null,null,null,{"$f":"IF(Konfiguration!B852=\"\",\"\",Konfiguration!C852)","v":""},{"$f":"IF(Konfiguration!B852=\"\",\"\",Konfiguration!D852)","v":""},null,null,null,{"$f":"IF(B861=\"\",\"\",SUMIF(Ausgaben!B:B,B861,Ausgaben!A:A))","v":""}]
[null,{"$f":"IF(Konfiguration!B853=\"\",\"\",Konfiguration!B853)","v":""},null,null,null,{"$f":"IF(Konfiguration!B853=\"\",\"\",Konfiguration!C853)","v":""},{"$f":"IF(Konfiguration!B853=\"\",\"\",Konfiguration!D853)","v":""},null,null,null,{"$f":"IF(B862=\"\",\"\",SUMIF(Ausgaben!B:B,B862,Ausgaben!A:A))","v":""}]
[null,{"$f":"IF(Konfiguration!B854=\"\",\"\",Konfiguration!B854)","v":""},null,null,null,{"$f":"IF(Konfiguration!B854=\"\",\"\",Konfiguration!C854)","v":""},{"$f":"IF(Konfiguration!B854=\"\",\"\",Konfiguration!D854)","v":""},null,null,null,{"$f":"IF(B863=\"\",\"\",SUMIF(Ausgaben!B:B,B863,Ausgaben!A:A))","v":""}]
[null,{"$f":"IF(Konfiguration!B855=\"\",\"\",Konfiguration!B855)","v":""},null,null,null,{"$f":"IF(Konfiguration!B855=\"\",\"\",Konfiguration!C855)","v":""},{"$f":"IF(Konfiguration!B855=\"\",\"\",Konfiguration!D855)","v":""},null,null,null,{"$f":"IF(B864=\"\",\"\",SUMIF(Ausgaben!B:B,B864,Ausgaben!A:A))","v":""}]
[null,{"$f":"IF(Konfiguration!B856=\"\",\"\",Konfiguration!B856)","v":""},null,null,null,{"$f":"IF(Konfiguration!B856=\"\",\"\",Konfiguration!C856)","v":""},{"$f":"IF(Konfiguration!B856=\"\",\"\",Konfiguration!D856)","v":""},null,null,null,{"$f":"IF(B865=\"\",\"\",SUMIF(Ausgaben!B:B,B865,Ausgaben!A:A))","v":""}]
[null,{"$f":"IF(Konfiguration!B857=\"\",\"\",Konfiguration!B857)","v":""},null,null,null,{"$f":"IF(Konfiguration!B857=\"\",\"\",Konfiguration!C857)","v":""},{"$f":"IF(Konfiguration!B857=\"\",\"\",Konfiguration!D857)","v":""},null,null,null,{"$f":"IF(B866=\"\",\"\",SUMIF(Ausgaben!B:B,B866,Ausgaben!A:A))","v":""}]
[null,{"$f":"IF(Konfiguration!B858=\"\",\"\",Konfiguration!B858)","v":""},null,null,null,{"$f":"IF(Konfiguration!B858=\"\",\"\",Konfiguration!C858)","v":""},{"$f":"IF(Konfiguration!B858=\"\",\"\",Konfiguration!D858)","v":""},null,null,null,{"$f":"IF(B867=\"\",\"\",SUMIF(Ausgaben!B:B,B867,Ausgaben!A:A))","v":""}]
[null,{"$f":"IF(Konfiguration!B859=\"\",\"\",Konfiguration!B859)","v":""},null,null,null,{"$f":"IF(Konfiguration!B859=\"\",\"\",Konfiguration!C859)","v":""},{"$f":"IF(Konfiguration!B859=\"\",\"\",Konfiguration!D859)","v":""},null,null,null,{"$f":"IF(B868=\"\",\"\",SUMIF(Ausgaben!B:B,B868,Ausgaben!A:A))","v":""}]
[null,{"$f":"IF(Konfiguration!B860=\"\",\"\",Konfiguration!B860)","v":""},null,null,null,{"$f":"IF(Konfiguration!B860=\"\",\"\",Konfiguration!C860)","v":""},{"$f":"IF(Konfiguration!B860=\"\",\"\",Konfiguration!D860)","v":""},null,null,null,{"$f":"IF(B869=\"\",\"\",SUMIF(Ausgaben!B:B,B869,Ausgaben!A:A))","v":""}]
[null,{"$f":"IF(Konfiguration!B861=\"\",\"\",Konfiguration!B861)","v":""},null,null,null,{"$f":"IF(Konfiguration!B861=\"\",\"\",Konfiguration!C861)","v":""},{"$f":"IF(Konfiguration!B861=\"\",\"\",Konfiguration!D861)","v":""},null,null,null,{"$f":"IF(B870=\"\",\"\",SUMIF(Ausgaben!B:B,B870,Ausgaben!A:A))","v":""}]
[null,{"$f":"IF(Konfiguration!B862=\"\",\"\",Konfiguration!B862)","v":""},null,null,null,{"$f":"IF(Konfiguration!B862=\"\",\"\",Konfiguration!C862)","v":""},{"$f":"IF(Konfiguration!B862=\"\",\"\",Konfiguration!D862)","v":""},null,null,null,{"$f":"IF(B871=\"\",\"\",SUMIF(Ausgaben!B:B,B871,Ausgaben!A:A))","v":""}]
[null,{"$f":"IF(Konfiguration!B863=\"\",\"\",Konfiguration!B863)","v":""},null,null,null,{"$f":"IF(Konfiguration!B863=\"\",\"\",Konfiguration!C863)","v":""},{"$f":"IF(Konfiguration!B863=\"\",\"\",Konfiguration!D863)","v":""},null,null,null,{"$f":"IF(B872=\"\",\"\",SUMIF(Ausgaben!B:B,B872,Ausgaben!A:A))","v":""}]
[null,{"$f":"IF(Konfiguration!B864=\"\",\"\",Konfiguration!B864)","v":""},null,null,null,{"$f":"IF(Konfiguration!B864=\"\",\"\",Konfiguration!C864)","v":""},{"$f":"IF(Konfiguration!B864=\"\",\"\",Konfiguration!D864)","v":""},null,null,null,{"$f":"IF(B873=\"\",\"\",SUMIF(Ausgaben!B:B,B873,Ausgaben!A:A))","v":""}]
[null,{"$f":"IF(Konfiguration!B865=\"\",\"\",Konfiguration!B865)","v":""},null,null,null,{"$f":"IF(Konfiguration!B865=\"\",\"\",Konfiguration!C865)","v":""},{"$f":"IF(Konfiguration!B865=\"\",\"\",Konfiguration!D865)","v":""},null,null,null,{"$f":"IF(B874=\"\",\"\",SUMIF(Ausgaben!B:B,B874,Ausgaben!A:A))","v":""}]
[null,{"$f":"IF(Konfiguration!B866=\"\",\"\",Konfiguration!B866)","v":""},null,null,null,{"$f":"IF(Konfiguration!B866=\"\",\"\",Konfiguration!C866)","v":""},{"$f":"IF(Konfiguration!B866=\"\",\"\",Konfiguration!D866)","v":""},null,null,null,{"$f":"IF(B875=\"\",\"\",SUMIF(Ausgaben!B:B,B875,Ausgaben!A:A))","v":""}]
[null,{"$f":"IF(Konfiguration!B867=\"\",\"\",Konfiguration!B867)","v":""},null,null,null,{"$f":"IF(Konfiguration!B867=\"\",\"\",Konfiguration!C867)","v":""},{"$f":"IF(Konfiguration!B867=\"\",\"\",Konfiguration!D867)","v":""},null,null,null,{"$f":"IF(B876=\"\",\"\",SUMIF(Ausgaben!B:B,B876,Ausgaben!A:A))","v":""}]
[null,{"$f":"IF(Konfiguration!B868=\"\",\"\",Konfiguration!B868)","v":""},null,null,null,{"$f":"IF(Konfiguration!B868=\"\",\"\",Konfiguration!C868)","v":""},{"$f":"IF(Konfiguration!B868=\"\",\"\",Konfiguration!D868)","v":""},null,null,null,{"$f":"IF(B877=\"\",\"\",SUMIF(Ausgaben!B:B,B877,Ausgaben!A:A))","v":""}]
[null,{"$f":"IF(Konfiguration!B869=\"\",\"\",Konfiguration!B869)","v":""},null,null,null,{"$f":"IF(Konfiguration!B869=\"\",\"\",Konfiguration!C869)","v":""},{"$f":"IF(Konfiguration!B869=\"\",\"\",Konfiguration!D869)","v":""},null,null,null,{"$f":"IF(B878=\"\",\"\",SUMIF(Ausgaben!B:B,B878,Ausgaben!A:A))","v":""}]
[null,{"$f":"IF(Konfiguration!B870=\"\",\"\",Konfiguration!B870)","v":""},null,null,null,{"$f":"IF(Konfiguration!B870=\"\",\"\",Konfiguration!C870)","v":""},{"$f":"IF(Konfiguration!B870=\"\",\"\",Konfiguration!D870)","v":""},null,null,null,{"$f":"IF(B879=\"\",\"\",SUMIF(Ausgaben!B:B,B879,Ausgaben!A:A))","v":""}]
[null,{"$f":"IF(Konfiguration!B871=\"\",\"\",Konfiguration!B871)","v":""},null,null,null,{"$f":"IF(Konfiguration!B871=\"\",\"\",Konfiguration!C871)","v":""},{"$f":"IF(Konfiguration!B871=\"\",\"\",Konfiguration!D871)","v":""},null,null,null,{"$f":"IF(B880=\"\",\"\",SUMIF(Ausgaben!B:B,B880,Ausgaben!A:A))","v":""}]
[null,{"$f":"IF(Konfiguration!B872=\"\",\"\",Konfiguration!B872)","v":""},null,null,null,{"$f":"IF(Konfiguration!B872=\"\",\"\",Konfiguration!C872)","v":""},{"$f":"IF(Konfiguration!B872=\"\",\"\",Konfiguration!D872)","v":""},null,null,null,{"$f":"IF(B881=\"\",\"\",SUMIF(Ausgaben!B:B,B881,Ausgaben!A:A))","v":""}]
[null,{"$f":"IF(Konfiguration!B873=\"\",\"\",Konfiguration!B873)","v":""},null,null,null,{"$f":"IF(Konfiguration!B873=\"\",\"\",Konfiguration!C873)","v":""},{"$f":"IF(Konfiguration!B873=\"\",\"\",Konfiguration!D873)","v":""},null,null,null,{"$f":"IF(B882=\"\",\"\",SUMIF(Ausgaben!B:B,B882,Ausgaben!A:A))","v":""}]
[null,{"$f":"IF(Konfiguration!B874=\"\",\"\",Konfiguration!B874)","v":""},null,null,null,{"$f":"IF(Konfiguration!B874=\"\",\"\",Konfiguration!C874)","v":""},{"$f":"IF(Konfiguration!B874=\"\",\"\",Konfiguration!D874)","v":""},null,null,null,{"$f":"IF(B883=\"\",\"\",SUMIF(Ausgaben!B:B,B883,Ausgaben!A:A))","v":""}]
[null,{"$f":"IF(Konfiguration!B875=\"\",\"\",Konfiguration!B875)","v":""},null,null,null,{"$f":"IF(Konfiguration!B875=\"\",\"\",Konfiguration!C875)","v":""},{"$f":"IF(Konfiguration!B875=\"\",\"\",Konfiguration!D875)","v":""},null,null,null,{"$f":"IF(B884=\"\",\"\",SUMIF(Ausgaben!B:B,B884,Ausgaben!A:A))","v":""}]
[null,{"$f":"IF(Konfiguration!B876=\"\",\"\",Konfiguration!B876)","v":""},null,null,null,{"$f":"IF(Konfiguration!B876=\"\",\"\",Konfiguration!C876)","v":""},{"$f":"IF(Konfiguration!B876=\"\",\"\",Konfiguration!D876)","v":""},null,null,null,{"$f":"IF(B885=\"\",\"\",SUMIF(Ausgaben!B:B,B885,Ausgaben!A:A))","v":""}]
[null,{"$f":"IF(Konfiguration!B877=\"\",\"\",Konfiguration!B877)","v":""},null,null,null,{"$f":"IF(Konfiguration!B877=\"\",\"\",Konfiguration!C877)","v":""},{"$f":"IF(Konfiguration!B877=\"\",\"\",Konfiguration!D877)","v":""},null,null,null,{"$f":"IF(B886=\"\",\"\",SUMIF(Ausgaben!B:B,B886,Ausgaben!A:A))","v":""}]
[null,{"$f":"IF(Konfiguration!B878=\"\",\"\",Konfiguration!B878)","v":""},null,null,null,{"$f":"IF(Konfiguration!B878=\"\",\"\",Konfiguration!C878)","v":""},{"$f":"IF(Konfiguration!B878=\"\",\"\",Konfiguration!D878)","v":""},null,null,null,{"$f":"IF(B887=\"\",\"\",SUMIF(Ausgaben!B:B,B887,Ausgaben!A:A))","v":""}]
[null,{"$f":"IF(Konfiguration!B879=\"\",\"\",Konfiguration!B879)","v":""},null,null,null,{"$f":"IF(Konfiguration!B879=\"\",\"\",Konfiguration!C879)","v":""},{"$f":"IF(Konfiguration!B879=\"\",\"\",Konfiguration!D879)","v":""},null,null,null,{"$f":"IF(B888=\"\",\"\",SUMIF(Ausgaben!B:B,B888,Ausgaben!A:A))","v":""}]
[null,{"$f":"IF(Konfiguration!B880=\"\",\"\",Konfiguration!B880)","v":""},null,null,null,{"$f":"IF(Konfiguration!B880=\"\",\"\",Konfiguration!C880)","v":""},{"$f":"IF(Konfiguration!B880=\"\",\"\",Konfiguration!D880)","v":""},null,null,null,{"$f":"IF(B889=\"\",\"\",SUMIF(Ausgaben!B:B,B889,Ausgaben!A:A))","v":""}]
[null,{"$f":"IF(Konfiguration!B881=\"\",\"\",Konfiguration!B881)","v":""},null,null,null,{"$f":"IF(Konfiguration!B881=\"\",\"\",Konfiguration!C881)","v":""},{"$f":"IF(Konfiguration!B881=\"\",\"\",Konfiguration!D881)","v":""},null,null,null,{"$f":"IF(B890=\"\",\"\",SUMIF(Ausgaben!B:B,B890,Ausgaben!A:A))","v":""}]
[null,{"$f":"IF(Konfiguration!B882=\"\",\"\",Konfiguration!B882)","v":""},null,null,null,{"$f":"IF(Konfiguration!B882=\"\",\"\",Konfiguration!C882)","v":""},{"$f":"IF(Konfiguration!B882=\"\",\"\",Konfiguration!D882)","v":""},null,null,null,{"$f":"IF(B891=\"\",\"\",SUMIF(Ausgaben!B:B,B891,Ausgaben!A:A))","v":""}]
[null,{"$f":"IF(Konfiguration!B883=\"\",\"\",Konfiguration!B883)","v":""},null,null,null,{"$f":"IF(Konfiguration!B883=\"\",\"\",Konfiguration!C883)","v":""},{"$f":"IF(Konfiguration!B883=\"\",\"\",Konfiguration!D883)","v":""},null,null,null,{"$f":"IF(B892=\"\",\"\",SUMIF(Ausgaben!B:B,B892,Ausgaben!A:A))","v":""}]
[null,{"$f":"IF(Konfiguration!B884=\"\",\"\",Konfiguration!B884)","v":""},null,null,null,{"$f":"IF(Konfiguration!B884=\"\",\"\",Konfiguration!C884)","v":""},{"$f":"IF(Konfiguration!B884=\"\",\"\",Konfiguration!D884)","v":""},null,null,null,{"$f":"IF(B893=\"\",\"\",SUMIF(Ausgaben!B:B,B893,Ausgaben!A:A))","v":""}]
[null,{"$f":"IF(Konfiguration!B885=\"\",\"\",Konfiguration!B885)","v":""},null,null,null,{"$f":"IF(Konfiguration!B885=\"\",\"\",Konfiguration!C885)","v":""},{"$f":"IF(Konfiguration!B885=\"\",\"\",Konfiguration!D885)","v":""},null,null,null,{"$f":"IF(B894=\"\",\"\",SUMIF(Ausgaben!B:B,B894,Ausgaben!A:A))","v":""}]
[null,{"$f":"IF(Konfiguration!B886=\"\",\"\",Konfiguration!B886)","v":""},null,null,null,{"$f":"IF(Konfiguration!B886=\"\",\"\",Konfiguration!C886)","v":""},{"$f":"IF(Konfiguration!B886=\"\",\"\",Konfiguration!D886)","v":""},null,null,null,{"$f":"IF(B895=\"\",\"\",SUMIF(Ausgaben!B:B,B895,Ausgaben!A:A))","v":""}]
[null,{"$f":"IF(Konfiguration!B887=\"\",\"\",Konfiguration!B887)","v":""},null,null,null,{"$f":"IF(Konfiguration!B887=\"\",\"\",Konfiguration!C887)","v":""},{"$f":"IF(Konfiguration!B887=\"\",\"\",Konfiguration!D887)","v":""},null,null,null,{"$f":"IF(B896=\"\",\"\",SUMIF(Ausgaben!B:B,B896,Ausgaben!A:A))","v":""}]
[null,{"$f":"IF(Konfiguration!B888=\"\",\"\",Konfiguration!B888)","v":""},null,null,null,{"$f":"IF(Konfiguration!B888=\"\",\"\",Konfiguration!C888)","v":""},{"$f":"IF(Konfiguration!B888=\"\",\"\",Konfiguration!D888)","v":""},null,null,null,{"$f":"IF(B897=\"\",\"\",SUMIF(Ausgaben!B:B,B897,Ausgaben!A:A))","v":""}]
[null,{"$f":"IF(Konfiguration!B889=\"\",\"\",Konfiguration!B889)","v":""},null,null,null,{"$f":"IF(Konfiguration!B889=\"\",\"\",Konfiguration!C889)","v":""},{"$f":"IF(Konfiguration!B889=\"\",\"\",Konfiguration!D889)","v":""},null,null,null,{"$f":"IF(B898=\"\",\"\",SUMIF(Ausgaben!B:B,B898,Ausgaben!A:A))","v":""}]
[null,{"$f":"IF(Konfiguration!B890=\"\",\"\",Konfiguration!B890)","v":""},null,null,null,{"$f":"IF(Konfiguration!B890=\"\",\"\",Konfiguration!C890)","v":""},{"$f":"IF(Konfiguration!B890=\"\",\"\",Konfiguration!D890)","v":""},null,null,null,{"$f":"IF(B899=\"\",\"\",SUMIF(Ausgaben!B:B,B899,Ausgaben!A:A))","v":""}]
[null,{"$f":"IF(Konfiguration!B891=\"\",\"\",Konfiguration!B891)","v":""},null,null,null,{"$f":"IF(Konfiguration!B891=\"\",\"\",Konfiguration!C891)","v":""},{"$f":"IF(Konfiguration!B891=\"\",\"\",Konfiguration!D891)","v":""},null,null,null,{"$f":"IF(B900=\"\",\"\",SUMIF(Ausgaben!B:B,B900,Ausgaben!A:A))","v":""}]
[null,{"$f":"IF(Konfiguration!B892=\"\",\"\",Konfiguration!B892)","v":""},null,null,null,{"$f":"IF(Konfiguration!B892=\"\",\"\",Konfiguration!C892)","v":""},{"$f":"IF(Konfiguration!B892=\"\",\"\",Konfiguration!D892)","v":""},null,null,null,{"$f":"IF(B901=\"\",\"\",SUMIF(Ausgaben!B:B,B901,Ausgaben!A:A))","v":""}]
[null,{"$f":"IF(Konfiguration!B893=\"\",\"\",Konfiguration!B893)","v":""},null,null,null,{"$f":"IF(Konfiguration!B893=\"\",\"\",Konfiguration!C893)","v":""},{"$f":"IF(Konfiguration!B893=\"\",\"\",Konfiguration!D893)","v":""},null,null,null,{"$f":"IF(B902=\"\",\"\",SUMIF(Ausgaben!B:B,B902,Ausgaben!A:A))","v":""}]
[null,{"$f":"IF(Konfiguration!B894=\"\",\"\",Konfiguration!B894)","v":""},null,null,null,{"$f":"IF(Konfiguration!B894=\"\",\"\",Konfiguration!C894)","v":""},{"$f":"IF(Konfiguration!B894=\"\",\"\",Konfiguration!D894)","v":""},null,null,null,{"$f":"IF(B903=\"\",\"\",SUMIF(Ausgaben!B:B,B903,Ausgaben!A:A))","v":""}]
[null,{"$f":"IF(Konfiguration!B895=\"\",\"\",Konfiguration!B895)","v":""},null,null,null,{"$f":"IF(Konfiguration!B895=\"\",\"\",Konfiguration!C895)","v":""},{"$f":"IF(Konfiguration!B895=\"\",\"\",Konfiguration!D895)","v":""},null,null,null,{"$f":"IF(B904=\"\",\"\",SUMIF(Ausgaben!B:B,B904,Ausgaben!A:A))","v":""}]
[null,{"$f":"IF(Konfiguration!B896=\"\",\"\",Konfiguration!B896)","v":""},null,null,null,{"$f":"IF(Konfiguration!B896=\"\",\"\",Konfiguration!C896)","v":""},{"$f":"IF(Konfiguration!B896=\"\",\"\",Konfiguration!D896)","v":""},null,null,null,{"$f":"IF(B905=\"\",\"\",SUMIF(Ausgaben!B:B,B905,Ausgaben!A:A))","v":""}]
[null,{"$f":"IF(Konfiguration!B897=\"\",\"\",Konfiguration!B897)","v":""},null,null,null,{"$f":"IF(Konfiguration!B897=\"\",\"\",Konfiguration!C897)","v":""},{"$f":"IF(Konfiguration!B897=\"\",\"\",Konfiguration!D897)","v":""},null,null,null,{"$f":"IF(B906=\"\",\"\",SUMIF(Ausgaben!B:B,B906,Ausgaben!A:A))","v":""}]
[null,{"$f":"IF(Konfiguration!B898=\"\",\"\",Konfiguration!B898)","v":""},null,null,null,{"$f":"IF(Konfiguration!B898=\"\",\"\",Konfiguration!C898)","v":""},{"$f":"IF(Konfiguration!B898=\"\",\"\",Konfiguration!D898)","v":""},null,null,null,{"$f":"IF(B907=\"\",\"\",SUMIF(Ausgaben!B:B,B907,Ausgaben!A:A))","v":""}]
[null,{"$f":"IF(Konfiguration!B899=\"\",\"\",Konfiguration!B899)","v":""},null,null,null,{"$f":"IF(Konfiguration!B899=\"\",\"\",Konfiguration!C899)","v":""},{"$f":"IF(Konfiguration!B899=\"\",\"\",Konfiguration!D899)","v":""},null,null,null,{"$f":"IF(B908=\"\",\"\",SUMIF(Ausgaben!B:B,B908,Ausgaben!A:A))","v":""}]
[null,{"$f":"IF(Konfiguration!B900=\"\",\"\",Konfiguration!B900)","v":""},null,null,null,{"$f":"IF(Konfiguration!B900=\"\",\"\",Konfiguration!C900)","v":""},{"$f":"IF(Konfiguration!B900=\"\",\"\",Konfiguration!D900)","v":""},null,null,null,{"$f":"IF(B909=\"\",\"\",SUMIF(Ausgaben!B:B,B909,Ausgaben!A:A))","v":""}]
[null,{"$f":"IF(Konfiguration!B901=\"\",\"\",Konfiguration!B901)","v":""},null,null,null,{"$f":"IF(Konfiguration!B901=\"\",\"\",Konfiguration!C901)","v":""},{"$f":"IF(Konfiguration!B901=\"\",\"\",Konfiguration!D901)","v":""},null,null,null,{"$f":"IF(B910=\"\",\"\",SUMIF(Ausgaben!B:B,B910,Ausgaben!A:A))","v":""}]
[null,{"$f":"IF(Konfiguration!B902=\"\",\"\",Konfiguration!B902)","v":""},null,null,null,{"$f":"IF(Konfiguration!B902=\"\",\"\",Konfiguration!C902)","v":""},{"$f":"IF(Konfiguration!B902=\"\",\"\",Konfiguration!D902)","v":""},null,null,null,{"$f":"IF(B911=\"\",\"\",SUMIF(Ausgaben!B:B,B911,Ausgaben!A:A))","v":""}]
[null,{"$f":"IF(Konfiguration!B903=\"\",\"\",Konfiguration!B903)","v":""},null,null,null,{"$f":"IF(Konfiguration!B903=\"\",\"\",Konfiguration!C903)","v":""},{"$f":"IF(Konfiguration!B903=\"\",\"\",Konfiguration!D903)","v":""},null,null,null,{"$f":"IF(B912=\"\",\"\",SUMIF(Ausgaben!B:B,B912,Ausgaben!A:A))","v":""}]
[null,{"$f":"IF(Konfiguration!B904=\"\",\"\",Konfiguration!B904)","v":""},null,null,null,{"$f":"IF(Konfiguration!B904=\"\",\"\",Konfiguration!C904)","v":""},{"$f":"IF(Konfiguration!B904=\"\",\"\",Konfiguration!D904)","v":""},null,null,null,{"$f":"IF(B913=\"\",\"\",SUMIF(Ausgaben!B:B,B913,Ausgaben!A:A))","v":""}]
[null,{"$f":"IF(Konfiguration!B905=\"\",\"\",Konfiguration!B905)","v":""},null,null,null,{"$f":"IF(Konfiguration!B905=\"\",\"\",Konfiguration!C905)","v":""},{"$f":"IF(Konfiguration!B905=\"\",\"\",Konfiguration!D905)","v":""},null,null,null,{"$f":"IF(B914=\"\",\"\",SUMIF(Ausgaben!B:B,B914,Ausgaben!A:A))","v":""}]
[null,{"$f":"IF(Konfiguration!B906=\"\",\"\",Konfiguration!B906)","v":""},null,null,null,{"$f":"IF(Konfiguration!B906=\"\",\"\",Konfiguration!C906)","v":""},{"$f":"IF(Konfiguration!B906=\"\",\"\",Konfiguration!D906)","v":""},null,null,null,{"$f":"IF(B915=\"\",\"\",SUMIF(Ausgaben!B:B,B915,Ausgaben!A:A))","v":""}]
[null,{"$f":"IF(Konfiguration!B907=\"\",\"\",Konfiguration!B907)","v":""},null,null,null,{"$f":"IF(Konfiguration!B907=\"\",\"\",Konfiguration!C907)","v":""},{"$f":"IF(Konfiguration!B907=\"\",\"\",Konfiguration!D907)","v":""},null,null,null,{"$f":"IF(B916=\"\",\"\",SUMIF(Ausgaben!B:B,B916,Ausgaben!A:A))","v":""}]
[null,{"$f":"IF(Konfiguration!B908=\"\",\"\",Konfiguration!B908)","v":""},null,null,null,{"$f":"IF(Konfiguration!B908=\"\",\"\",Konfiguration!C908)","v":""},{"$f":"IF(Konfiguration!B908=\"\",\"\",Konfiguration!D908)","v":""},null,null,null,{"$f":"IF(B917=\"\",\"\",SUMIF(Ausgaben!B:B,B917,Ausgaben!A:A))","v":""}]
[null,{"$f":"IF(Konfiguration!B909=\"\",\"\",Konfiguration!B909)","v":""},null,null,null,{"$f":"IF(Konfiguration!B909=\"\",\"\",Konfiguration!C909)","v":""},{"$f":"IF(Konfiguration!B909=\"\",\"\",Konfiguration!D909)","v":""},null,null,null,{"$f":"IF(B918=\"\",\"\",SUMIF(Ausgaben!B:B,B918,Ausgaben!A:A))","v":""}]
[null,{"$f":"IF(Konfiguration!B910=\"\",\"\",Konfiguration!B910)","v":""},null,null,null,{"$f":"IF(Konfiguration!B910=\"\",\"\",Konfiguration!C910)","v":""},{"$f":"IF(Konfiguration!B910=\"\",\"\",Konfiguration!D910)","v":""},null,null,null,{"$f":"IF(B919=\"\",\"\",SUMIF(Ausgaben!B:B,B919,Ausgaben!A:A))","v":""}]
[null,{"$f":"IF(Konfiguration!B911=\"\",\"\",Konfiguration!B911)","v":""},null,null,null,{"$f":"IF(Konfiguration!B911=\"\",\"\",Konfiguration!C911)","v":""},{"$f":"IF(Konfiguration!B911=\"\",\"\",Konfiguration!D911)","v":""},null,null,null,{"$f":"IF(B920=\"\",\"\",SUMIF(Ausgaben!B:B,B920,Ausgaben!A:A))","v":""}]
[null,{"$f":"IF(Konfiguration!B912=\"\",\"\",Konfiguration!B912)","v":""},null,null,null,{"$f":"IF(Konfiguration!B912=\"\",\"\",Konfiguration!C912)","v":""},{"$f":"IF(Konfiguration!B912=\"\",\"\",Konfiguration!D912)","v":""},null,null,null,{"$f":"IF(B921=\"\",\"\",SUMIF(Ausgaben!B:B,B921,Ausgaben!A:A))","v":""}]
[null,{"$f":"IF(Konfiguration!B913=\"\",\"\",Konfiguration!B913)","v":""},null,null,null,{"$f":"IF(Konfiguration!B913=\"\",\"\",Konfiguration!C913)","v":""},{"$f":"IF(Konfiguration!B913=\"\",\"\",Konfiguration!D913)","v":""},null,null,null,{"$f":"IF(B922=\"\",\"\",SUMIF(Ausgaben!B:B,B922,Ausgaben!A:A))","v":""}]
[null,{"$f":"IF(Konfiguration!B914=\"\",\"\",Konfiguration!B914)","v":""},null,null,null,{"$f":"IF(Konfiguration!B914=\"\",\"\",Konfiguration!C914)","v":""},{"$f":"IF(Konfiguration!B914=\"\",\"\",Konfiguration!D914)","v":""},null,null,null,{"$f":"IF(B923=\"\",\"\",SUMIF(Ausgaben!B:B,B923,Ausgaben!A:A))","v":""}]
[null,{"$f":"IF(Konfiguration!B915=\"\",\"\",Konfiguration!B915)","v":""},null,null,null,{"$f":"IF(Konfiguration!B915=\"\",\"\",Konfiguration!C915)","v":""},{"$f":"IF(Konfiguration!B915=\"\",\"\",Konfiguration!D915)","v":""},null,null,null,{"$f":"IF(B924=\"\",\"\",SUMIF(Ausgaben!B:B,B924,Ausgaben!A:A))","v":""}]
[null,{"$f":"IF(Konfiguration!B916=\"\",\"\",Konfiguration!B916)","v":""},null,null,null,{"$f":"IF(Konfiguration!B916=\"\",\"\",Konfiguration!C916)","v":""},{"$f":"IF(Konfiguration!B916=\"\",\"\",Konfiguration!D916)","v":""},null,null,null,{"$f":"IF(B925=\"\",\"\",SUMIF(Ausgaben!B:B,B925,Ausgaben!A:A))","v":""}]
[null,{"$f":"IF(Konfiguration!B917=\"\",\"\",Konfiguration!B917)","v":""},null,null,null,{"$f":"IF(Konfiguration!B917=\"\",\"\",Konfiguration!C917)","v":""},{"$f":"IF(Konfiguration!B917=\"\",\"\",Konfiguration!D917)","v":""},null,null,null,{"$f":"IF(B926=\"\",\"\",SUMIF(Ausgaben!B:B,B926,Ausgaben!A:A))","v":""}]
[null,{"$f":"IF(Konfiguration!B918=\"\",\"\",Konfiguration!B918)","v":""},null,null,null,{"$f":"IF(Konfiguration!B918=\"\",\"\",Konfiguration!C918)","v":""},{"$f":"IF(Konfiguration!B918=\"\",\"\",Konfiguration!D918)","v":""},null,null,null,{"$f":"IF(B927=\"\",\"\",SUMIF(Ausgaben!B:B,B927,Ausgaben!A:A))","v":""}]
[null,{"$f":"IF(Konfiguration!B919=\"\",\"\",Konfiguration!B919)","v":""},null,null,null,{"$f":"IF(Konfiguration!B919=\"\",\"\",Konfiguration!C919)","v":""},{"$f":"IF(Konfiguration!B919=\"\",\"\",Konfiguration!D919)","v":""},null,null,null,{"$f":"IF(B928=\"\",\"\",SUMIF(Ausgaben!B:B,B928,Ausgaben!A:A))","v":""}]
[null,{"$f":"IF(Konfiguration!B920=\"\",\"\",Konfiguration!B920)","v":""},null,null,null,{"$f":"IF(Konfiguration!B920=\"\",\"\",Konfiguration!C920)","v":""},{"$f":"IF(Konfiguration!B920=\"\",\"\",Konfiguration!D920)","v":""},null,null,null,{"$f":"IF(B929=\"\",\"\",SUMIF(Ausgaben!B:B,B929,Ausgaben!A:A))","v":""}]
[null,{"$f":"IF(Konfiguration!B921=\"\",\"\",Konfiguration!B921)","v":""},null,null,null,{"$f":"IF(Konfiguration!B921=\"\",\"\",Konfiguration!C921)","v":""},{"$f":"IF(Konfiguration!B921=\"\",\"\",Konfiguration!D921)","v":""},null,null,null,{"$f":"IF(B930=\"\",\"\",SUMIF(Ausgaben!B:B,B930,Ausgaben!A:A))","v":""}]
[null,{"$f":"IF(Konfiguration!B922=\"\",\"\",Konfiguration!B922)","v":""},null,null,null,{"$f":"IF(Konfiguration!B922=\"\",\"\",Konfiguration!C922)","v":""},{"$f":"IF(Konfiguration!B922=\"\",\"\",Konfiguration!D922)","v":""},null,null,null,{"$f":"IF(B931=\"\",\"\",SUMIF(Ausgaben!B:B,B931,Ausgaben!A:A))","v":""}]
[null,{"$f":"IF(Konfiguration!B923=\"\",\"\",Konfiguration!B923)","v":""},null,null,null,{"$f":"IF(Konfiguration!B923=\"\",\"\",Konfiguration!C923)","v":""},{"$f":"IF(Konfiguration!B923=\"\",\"\",Konfiguration!D923)","v":""},null,null,null,{"$f":"IF(B932=\"\",\"\",SUMIF(Ausgaben!B:B,B932,Ausgaben!A:A))","v":""}]
[null,{"$f":"IF(Konfiguration!B924=\"\",\"\",Konfiguration!B924)","v":""},null,null,null,{"$f":"IF(Konfiguration!B924=\"\",\"\",Konfiguration!C924)","v":""},{"$f":"IF(Konfiguration!B924=\"\",\"\",Konfiguration!D924)","v":""},null,null,null,{"$f":"IF(B933=\"\",\"\",SUMIF(Ausgaben!B:B,B933,Ausgaben!A:A))","v":""}]
[null,{"$f":"IF(Konfiguration!B925=\"\",\"\",Konfiguration!B925)","v":""},null,null,null,{"$f":"IF(Konfiguration!B925=\"\",\"\",Konfiguration!C925)","v":""},{"$f":"IF(Konfiguration!B925=\"\",\"\",Konfiguration!D925)","v":""},null,null,null,{"$f":"IF(B934=\"\",\"\",SUMIF(Ausgaben!B:B,B934,Ausgaben!A:A))","v":""}]
[null,{"$f":"IF(Konfiguration!B926=\"\",\"\",Konfiguration!B926)","v":""},null,null,null,{"$f":"IF(Konfiguration!B926=\"\",\"\",Konfiguration!C926)","v":""},{"$f":"IF(Konfiguration!B926=\"\",\"\",Konfiguration!D926)","v":""},null,null,null,{"$f":"IF(B935=\"\",\"\",SUMIF(Ausgaben!B:B,B935,Ausgaben!A:A))","v":""}]
[null,{"$f":"IF(Konfiguration!B927=\"\",\"\",Konfiguration!B927)","v":""},null,null,null,{"$f":"IF(Konfiguration!B927=\"\",\"\",Konfiguration!C927)","v":""},{"$f":"IF(Konfiguration!B927=\"\",\"\",Konfiguration!D927)","v":""},null,null,null,{"$f":"IF(B936=\"\",\"\",SUMIF(Ausgaben!B:B,B936,Ausgaben!A:A))","v":""}]
[null,{"$f":"IF(Konfiguration!B928=\"\",\"\",Konfiguration!B928)","v":""},null,null,null,{"$f":"IF(Konfiguration!B928=\"\",\"\",Konfiguration!C928)","v":""},{"$f":"IF(Konfiguration!B928=\"\",\"\",Konfiguration!D928)","v":""},null,null,null,{"$f":"IF(B937=\"\",\"\",SUMIF(Ausgaben!B:B,B937,Ausgaben!A:A))","v":""}]
[null,{"$f":"IF(Konfiguration!B929=\"\",\"\",Konfiguration!B929)","v":""},null,null,null,{"$f":"IF(Konfiguration!B929=\"\",\"\",Konfiguration!C929)","v":""},{"$f":"IF(Konfiguration!B929=\"\",\"\",Konfiguration!D929)","v":""},null,null,null,{"$f":"IF(B938=\"\",\"\",SUMIF(Ausgaben!B:B,B938,Ausgaben!A:A))","v":""}]
[null,{"$f":"IF(Konfiguration!B930=\"\",\"\",Konfiguration!B930)","v":""},null,null,null,{"$f":"IF(Konfiguration!B930=\"\",\"\",Konfiguration!C930)","v":""},{"$f":"IF(Konfiguration!B930=\"\",\"\",Konfiguration!D930)","v":""},null,null,null,{"$f":"IF(B939=\"\",\"\",SUMIF(Ausgaben!B:B,B939,Ausgaben!A:A))","v":""}]
[null,{"$f":"IF(Konfiguration!B931=\"\",\"\",Konfiguration!B931)","v":""},null,null,null,{"$f":"IF(Konfiguration!B931=\"\",\"\",Konfiguration!C931)","v":""},{"$f":"IF(Konfiguration!B931=\"\",\"\",Konfiguration!D931)","v":""},null,null,null,{"$f":"IF(B940=\"\",\"\",SUMIF(Ausgaben!B:B,B940,Ausgaben!A:A))","v":""}]
[null,{"$f":"IF(Konfiguration!B932=\"\",\"\",Konfiguration!B932)","v":""},null,null,null,{"$f":"IF(Konfiguration!B932=\"\",\"\",Konfiguration!C932)","v":""},{"$f":"IF(Konfiguration!B932=\"\",\"\",Konfiguration!D932)","v":""},null,null,null,{"$f":"IF(B941=\"\",\"\",SUMIF(Ausgaben!B:B,B941,Ausgaben!A:A))","v":""}]
[null,{"$f":"IF(Konfiguration!B933=\"\",\"\",Konfiguration!B933)","v":""},null,null,null,{"$f":"IF(Konfiguration!B933=\"\",\"\",Konfiguration!C933)","v":""},{"$f":"IF(Konfiguration!B933=\"\",\"\",Konfiguration!D933)","v":""},null,null,null,{"$f":"IF(B942=\"\",\"\",SUMIF(Ausgaben!B:B,B942,Ausgaben!A:A))","v":""}]
[null,{"$f":"IF(Konfiguration!B934=\"\",\"\",Konfiguration!B934)","v":""},null,null,null,{"$f":"IF(Konfiguration!B934=\"\",\"\",Konfiguration!C934)","v":""},{"$f":"IF(Konfiguration!B934=\"\",\"\",Konfiguration!D934)","v":""},null,null,null,{"$f":"IF(B943=\"\",\"\",SUMIF(Ausgaben!B:B,B943,Ausgaben!A:A))","v":""}]
[null,{"$f":"IF(Konfiguration!B935=\"\",\"\",Konfiguration!B935)","v":""},null,null,null,{"$f":"IF(Konfiguration!B935=\"\",\"\",Konfiguration!C935)","v":""},{"$f":"IF(Konfiguration!B935=\"\",\"\",Konfiguration!D935)","v":""},null,null,null,{"$f":"IF(B944=\"\",\"\",SUMIF(Ausgaben!B:B,B944,Ausgaben!A:A))","v":""}]
[null,{"$f":"IF(Konfiguration!B936=\"\",\"\",Konfiguration!B936)","v":""},null,null,null,{"$f":"IF(Konfiguration!B936=\"\",\"\",Konfiguration!C936)","v":""},{"$f":"IF(Konfiguration!B936=\"\",\"\",Konfiguration!D936)","v":""},null,null,null,{"$f":"IF(B945=\"\",\"\",SUMIF(Ausgaben!B:B,B945,Ausgaben!A:A))","v":""}]
[null,{"$f":"IF(Konfiguration!B937=\"\",\"\",Konfiguration!B937)","v":""},null,null,null,{"$f":"IF(Konfiguration!B937=\"\",\"\",Konfiguration!C937)","v":""},{"$f":"IF(Konfiguration!B937=\"\",\"\",Konfiguration!D937)","v":""},null,null,null,{"$f":"IF(B946=\"\",\"\",SUMIF(Ausgaben!B:B,B946,Ausgaben!A:A))","v":""}]
[null,{"$f":"IF(Konfiguration!B938=\"\",\"\",Konfiguration!B938)","v":""},null,null,null,{"$f":"IF(Konfiguration!B938=\"\",\"\",Konfiguration!C938)","v":""},{"$f":"IF(Konfiguration!B938=\"\",\"\",Konfiguration!D938)","v":""},null,null,null,{"$f":"IF(B947=\"\",\"\",SUMIF(Ausgaben!B:B,B947,Ausgaben!A:A))","v":""}]
[null,{"$f":"IF(Konfiguration!B939=\"\",\"\",Konfiguration!B939)","v":""},null,null,null,{"$f":"IF(Konfiguration!B939=\"\",\"\",Konfiguration!C939)","v":""},{"$f":"IF(Konfiguration!B939=\"\",\"\",Konfiguration!D939)","v":""},null,null,null,{"$f":"IF(B948=\"\",\"\",SUMIF(Ausgaben!B:B,B948,Ausgaben!A:A))","v":""}]
[null,{"$f":"IF(Konfiguration!B940=\"\",\"\",Konfiguration!B940)","v":""},null,null,null,{"$f":"IF(Konfiguration!B940=\"\",\"\",Konfiguration!C940)","v":""},{"$f":"IF(Konfiguration!B940=\"\",\"\",Konfiguration!D940)","v":""},null,null,null,{"$f":"IF(B949=\"\",\"\",SUMIF(Ausgaben!B:B,B949,Ausgaben!A:A))","v":""}]
[null,{"$f":"IF(Konfiguration!B941=\"\",\"\",Konfiguration!B941)","v":""},null,null,null,{"$f":"IF(Konfiguration!B941=\"\",\"\",Konfiguration!C941)","v":""},{"$f":"IF(Konfiguration!B941=\"\",\"\",Konfiguration!D941)","v":""},null,null,null,{"$f":"IF(B950=\"\",\"\",SUMIF(Ausgaben!B:B,B950,Ausgaben!A:A))","v":""}]
[null,{"$f":"IF(Konfiguration!B942=\"\",\"\",Konfiguration!B942)","v":""},null,null,null,{"$f":"IF(Konfiguration!B942=\"\",\"\",Konfiguration!C942)","v":""},{"$f":"IF(Konfiguration!B942=\"\",\"\",Konfiguration!D942)","v":""},null,null,null,{"$f":"IF(B951=\"\",\"\",SUMIF(Ausgaben!B:B,B951,Ausgaben!A:A))","v":""}]
[null,{"$f":"IF(Konfiguration!B943=\"\",\"\",Konfiguration!B943)","v":""},null,null,null,{"$f":"IF(Konfiguration!B943=\"\",\"\",Konfiguration!C943)","v":""},{"$f":"IF(Konfiguration!B943=\"\",\"\",Konfiguration!D943)","v":""},null,null,null,{"$f":"IF(B952=\"\",\"\",SUMIF(Ausgaben!B:B,B952,Ausgaben!A:A))","v":""}]
[null,{"$f":"IF(Konfiguration!B944=\"\",\"\",Konfiguration!B944)","v":""},null,null,null,{"$f":"IF(Konfiguration!B944=\"\",\"\",Konfiguration!C944)","v":""},{"$f":"IF(Konfiguration!B944=\"\",\"\",Konfiguration!D944)","v":""},null,null,null,{"$f":"IF(B953=\"\",\"\",SUMIF(Ausgaben!B:B,B953,Ausgaben!A:A))","v":""}]
[null,{"$f":"IF(Konfiguration!B945=\"\",\"\",Konfiguration!B945)","v":""},null,null,null,{"$f":"IF(Konfiguration!B945=\"\",\"\",Konfiguration!C945)","v":""},{"$f":"IF(Konfiguration!B945=\"\",\"\",Konfiguration!D945)","v":""},null,null,null,{"$f":"IF(B954=\"\",\"\",SUMIF(Ausgaben!B:B,B954,Ausgaben!A:A))","v":""}]
[null,{"$f":"IF(Konfiguration!B946=\"\",\"\",Konfiguration!B946)","v":""},null,null,null,{"$f":"IF(Konfiguration!B946=\"\",\"\",Konfiguration!C946)","v":""},{"$f":"IF(Konfiguration!B946=\"\",\"\",Konfiguration!D946)","v":""},null,null,null,{"$f":"IF(B955=\"\",\"\",SUMIF(Ausgaben!B:B,B955,Ausgaben!A:A))","v":""}]
[null,{"$f":"IF(Konfiguration!B947=\"\",\"\",Konfiguration!B947)","v":""},null,null,null,{"$f":"IF(Konfiguration!B947=\"\",\"\",Konfiguration!C947)","v":""},{"$f":"IF(Konfiguration!B947=\"\",\"\",Konfiguration!D947)","v":""},null,null,null,{"$f":"IF(B956=\"\",\"\",SUMIF(Ausgaben!B:B,B956,Ausgaben!A:A))","v":""}]
[null,{"$f":"IF(Konfiguration!B948=\"\",\"\",Konfiguration!B948)","v":""},null,null,null,{"$f":"IF(Konfiguration!B948=\"\",\"\",Konfiguration!C948)","v":""},{"$f":"IF(Konfiguration!B948=\"\",\"\",Konfiguration!D948)","v":""},null,null,null,{"$f":"IF(B957=\"\",\"\",SUMIF(Ausgaben!B:B,B957,Ausgaben!A:A))","v":""}]
[null,{"$f":"IF(Konfiguration!B949=\"\",\"\",Konfiguration!B949)","v":""},null,null,null,{"$f":"IF(Konfiguration!B949=\"\",\"\",Konfiguration!C949)","v":""},{"$f":"IF(Konfiguration!B949=\"\",\"\",Konfiguration!D949)","v":""},null,null,null,{"$f":"IF(B958=\"\",\"\",SUMIF(Ausgaben!B:B,B958,Ausgaben!A:A))","v":""}]
[null,{"$f":"IF(Konfiguration!B950=\"\",\"\",Konfiguration!B950)","v":""},null,null,null,{"$f":"IF(Konfiguration!B950=\"\",\"\",Konfiguration!C950)","v":""},{"$f":"IF(Konfiguration!B950=\"\",\"\",Konfiguration!D950)","v":""},null,null,null,{"$f":"IF(B959=\"\",\"\",SUMIF(Ausgaben!B:B,B959,Ausgaben!A:A))","v":""}]
[null,{"$f":"IF(Konfiguration!B951=\"\",\"\",Konfiguration!B951)","v":""},null,null,null,{"$f":"IF(Konfiguration!B951=\"\",\"\",Konfiguration!C951)","v":""},{"$f":"IF(Konfiguration!B951=\"\",\"\",Konfiguration!D951)","v":""},null,null,null,{"$f":"IF(B960=\"\",\"\",SUMIF(Ausgaben!B:B,B960,Ausgaben!A:A))","v":""}]
[null,{"$f":"IF(Konfiguration!B952=\"\",\"\",Konfiguration!B952)","v":""},null,null,null,{"$f":"IF(Konfiguration!B952=\"\",\"\",Konfiguration!C952)","v":""},{"$f":"IF(Konfiguration!B952=\"\",\"\",Konfiguration!D952)","v":""},null,null,null,{"$f":"IF(B961=\"\",\"\",SUMIF(Ausgaben!B:B,B961,Ausgaben!A:A))","v":""}]
[null,{"$f":"IF(Konfiguration!B953=\"\",\"\",Konfiguration!B953)","v":""},null,null,null,{"$f":"IF(Konfiguration!B953=\"\",\"\",Konfiguration!C953)","v":""},{"$f":"IF(Konfiguration!B953=\"\",\"\",Konfiguration!D953)","v":""},null,null,null,{"$f":"IF(B962=\"\",\"\",SUMIF(Ausgaben!B:B,B962,Ausgaben!A:A))","v":""}]
[null,{"$f":"IF(Konfiguration!B954=\"\",\"\",Konfiguration!B954)","v":""},null,null,null,{"$f":"IF(Konfiguration!B954=\"\",\"\",Konfiguration!C954)","v":""},{"$f":"IF(Konfiguration!B954=\"\",\"\",Konfiguration!D954)","v":""},null,null,null,{"$f":"IF(B963=\"\",\"\",SUMIF(Ausgaben!B:B,B963,Ausgaben!A:A))","v":""}]
[null,{"$f":"IF(Konfiguration!B955=\"\",\"\",Konfiguration!B955)","v":""},null,null,null,{"$f":"IF(Konfiguration!B955=\"\",\"\",Konfiguration!C955)","v":""},{"$f":"IF(Konfiguration!B955=\"\",\"\",Konfiguration!D955)","v":""},null,null,null,{"$f":"IF(B964=\"\",\"\",SUMIF(Ausgaben!B:B,B964,Ausgaben!A:A))","v":""}]
[null,{"$f":"IF(Konfiguration!B956=\"\",\"\",Konfiguration!B956)","v":""},null,null,null,{"$f":"IF(Konfiguration!B956=\"\",\"\",Konfiguration!C956)","v":""},{"$f":"IF(Konfiguration!B956=\"\",\"\",Konfiguration!D956)","v":""},null,null,null,{"$f":"IF(B965=\"\",\"\",SUMIF(Ausgaben!B:B,B965,Ausgaben!A:A))","v":""}]
[null,{"$f":"IF(Konfiguration!B957=\"\",\"\",Konfiguration!B957)","v":""},null,null,null,{"$f":"IF(Konfiguration!B957=\"\",\"\",Konfiguration!C957)","v":""},{"$f":"IF(Konfiguration!B957=\"\",\"\",Konfiguration!D957)","v":""},null,null,null,{"$f":"IF(B966=\"\",\"\",SUMIF(Ausgaben!B:B,B966,Ausgaben!A:A))","v":""}]
[null,{"$f":"IF(Konfiguration!B958=\"\",\"\",Konfiguration!B958)","v":""},null,null,null,{"$f":"IF(Konfiguration!B958=\"\",\"\",Konfiguration!C958)","v":""},{"$f":"IF(Konfiguration!B958=\"\",\"\",Konfiguration!D958)","v":""},null,null,null,{"$f":"IF(B967=\"\",\"\",SUMIF(Ausgaben!B:B,B967,Ausgaben!A:A))","v":""}]
[null,{"$f":"IF(Konfiguration!B959=\"\",\"\",Konfiguration!B959)","v":""},null,null,null,{"$f":"IF(Konfiguration!B959=\"\",\"\",Konfiguration!C959)","v":""},{"$f":"IF(Konfiguration!B959=\"\",\"\",Konfiguration!D959)","v":""},null,null,null,{"$f":"IF(B968=\"\",\"\",SUMIF(Ausgaben!B:B,B968,Ausgaben!A:A))","v":""}]
[null,{"$f":"IF(Konfiguration!B960=\"\",\"\",Konfiguration!B960)","v":""},null,null,null,{"$f":"IF(Konfiguration!B960=\"\",\"\",Konfiguration!C960)","v":""},{"$f":"IF(Konfiguration!B960=\"\",\"\",Konfiguration!D960)","v":""},null,null,null,{"$f":"IF(B969=\"\",\"\",SUMIF(Ausgaben!B:B,B969,Ausgaben!A:A))","v":""}]
[null,{"$f":"IF(Konfiguration!B961=\"\",\"\",Konfiguration!B961)","v":""},null,null,null,{"$f":"IF(Konfiguration!B961=\"\",\"\",Konfiguration!C961)","v":""},{"$f":"IF(Konfiguration!B961=\"\",\"\",Konfiguration!D961)","v":""},null,null,null,{"$f":"IF(B970=\"\",\"\",SUMIF(Ausgaben!B:B,B970,Ausgaben!A:A))","v":""}]
[null,{"$f":"IF(Konfiguration!B962=\"\",\"\",Konfiguration!B962)","v":""},null,null,null,{"$f":"IF(Konfiguration!B962=\"\",\"\",Konfiguration!C962)","v":""},{"$f":"IF(Konfiguration!B962=\"\",\"\",Konfiguration!D962)","v":""},null,null,null,{"$f":"IF(B971=\"\",\"\",SUMIF(Ausgaben!B:B,B971,Ausgaben!A:A))","v":""}]
[null,{"$f":"IF(Konfiguration!B963=\"\",\"\",Konfiguration!B963)","v":""},null,null,null,{"$f":"IF(Konfiguration!B963=\"\",\"\",Konfiguration!C963)","v":""},{"$f":"IF(Konfiguration!B963=\"\",\"\",Konfiguration!D963)","v":""},null,null,null,{"$f":"IF(B972=\"\",\"\",SUMIF(Ausgaben!B:B,B972,Ausgaben!A:A))","v":""}]
[null,{"$f":"IF(Konfiguration!B964=\"\",\"\",Konfiguration!B964)","v":""},null,null,null,{"$f":"IF(Konfiguration!B964=\"\",\"\",Konfiguration!C964)","v":""},{"$f":"IF(Konfiguration!B964=\"\",\"\",Konfiguration!D964)","v":""},null,null,null,{"$f":"IF(B973=\"\",\"\",SUMIF(Ausgaben!B:B,B973,Ausgaben!A:A))","v":""}]
[null,{"$f":"IF(Konfiguration!B965=\"\",\"\",Konfiguration!B965)","v":""},null,null,null,{"$f":"IF(Konfiguration!B965=\"\",\"\",Konfiguration!C965)","v":""},{"$f":"IF(Konfiguration!B965=\"\",\"\",Konfiguration!D965)","v":""},null,null,null,{"$f":"IF(B974=\"\",\"\",SUMIF(Ausgaben!B:B,B974,Ausgaben!A:A))","v":""}]
[null,{"$f":"IF(Konfiguration!B966=\"\",\"\",Konfiguration!B966)","v":""},null,null,null,{"$f":"IF(Konfiguration!B966=\"\",\"\",Konfiguration!C966)","v":""},{"$f":"IF(Konfiguration!B966=\"\",\"\",Konfiguration!D966)","v":""},null,null,null,{"$f":"IF(B975=\"\",\"\",SUMIF(Ausgaben!B:B,B975,Ausgaben!A:A))","v":""}]
[null,{"$f":"IF(Konfiguration!B967=\"\",\"\",Konfiguration!B967)","v":""},null,null,null,{"$f":"IF(Konfiguration!B967=\"\",\"\",Konfiguration!C967)","v":""},{"$f":"IF(Konfiguration!B967=\"\",\"\",Konfiguration!D967)","v":""},null,null,null,{"$f":"IF(B976=\"\",\"\",SUMIF(Ausgaben!B:B,B976,Ausgaben!A:A))","v":""}]
[null,{"$f":"IF(Konfiguration!B968=\"\",\"\",Konfiguration!B968)","v":""},null,null,null,{"$f":"IF(Konfiguration!B968=\"\",\"\",Konfiguration!C968)","v":""},{"$f":"IF(Konfiguration!B968=\"\",\"\",Konfiguration!D968)","v":""},null,null,null,{"$f":"IF(B977=\"\",\"\",SUMIF(Ausgaben!B:B,B977,Ausgaben!A:A))","v":""}]
[null,{"$f":"IF(Konfiguration!B969=\"\",\"\",Konfiguration!B969)","v":""},null,null,null,{"$f":"IF(Konfiguration!B969=\"\",\"\",Konfiguration!C969)","v":""},{"$f":"IF(Konfiguration!B969=\"\",\"\",Konfiguration!D969)","v":""},null,null,null,{"$f":"IF(B978=\"\",\"\",SUMIF(Ausgaben!B:B,B978,Ausgaben!A:A))","v":""}]
[null,{"$f":"IF(Konfiguration!B970=\"\",\"\",Konfiguration!B970)","v":""},null,null,null,{"$f":"IF(Konfiguration!B970=\"\",\"\",Konfiguration!C970)","v":""},{"$f":"IF(Konfiguration!B970=\"\",\"\",Konfiguration!D970)","v":""},null,null,null,{"$f":"IF(B979=\"\",\"\",SUMIF(Ausgaben!B:B,B979,Ausgaben!A:A))","v":""}]
[null,{"$f":"IF(Konfiguration!B971=\"\",\"\",Konfiguration!B971)","v":""},null,null,null,{"$f":"IF(Konfiguration!B971=\"\",\"\",Konfiguration!C971)","v":""},{"$f":"IF(Konfiguration!B971=\"\",\"\",Konfiguration!D971)","v":""},null,null,null,{"$f":"IF(B980=\"\",\"\",SUMIF(Ausgaben!B:B,B980,Ausgaben!A:A))","v":""}]
[null,{"$f":"IF(Konfiguration!B972=\"\",\"\",Konfiguration!B972)","v":""},null,null,null,{"$f":"IF(Konfiguration!B972=\"\",\"\",Konfiguration!C972)","v":""},{"$f":"IF(Konfiguration!B972=\"\",\"\",Konfiguration!D972)","v":""},null,null,null,{"$f":"IF(B981=\"\",\"\",SUMIF(Ausgaben!B:B,B981,Ausgaben!A:A))","v":""}]
[null,{"$f":"IF(Konfiguration!B973=\"\",\"\",Konfiguration!B973)","v":""},null,null,null,{"$f":"IF(Konfiguration!B973=\"\",\"\",Konfiguration!C973)","v":""},{"$f":"IF(Konfiguration!B973=\"\",\"\",Konfiguration!D973)","v":""},null,null,null,{"$f":"IF(B982=\"\",\"\",SUMIF(Ausgaben!B:B,B982,Ausgaben!A:A))","v":""}]
[null,{"$f":"IF(Konfiguration!B974=\"\",\"\",Konfiguration!B974)","v":""},null,null,null,{"$f":"IF(Konfiguration!B974=\"\",\"\",Konfiguration!C974)","v":""},{"$f":"IF(Konfiguration!B974=\"\",\"\",Konfiguration!D974)","v":""},null,null,null,{"$f":"IF(B983=\"\",\"\",SUMIF(Ausgaben!B:B,B983,Ausgaben!A:A))","v":""}]
[null,{"$f":"IF(Konfiguration!B975=\"\",\"\",Konfiguration!B975)","v":""},null,null,null,{"$f":"IF(Konfiguration!B975=\"\",\"\",Konfiguration!C975)","v":""},{"$f":"IF(Konfiguration!B975=\"\",\"\",Konfiguration!D975)","v":""},null,null,null,{"$f":"IF(B984=\"\",\"\",SUMIF(Ausgaben!B:B,B984,Ausgaben!A:A))","v":""}]
[null,{"$f":"IF(Konfiguration!B976=\"\",\"\",Konfiguration!B976)","v":""},null,null,null,{"$f":"IF(Konfiguration!B976=\"\",\"\",Konfiguration!C976)","v":""},{"$f":"IF(Konfiguration!B976=\"\",\"\",Konfiguration!D976)","v":""},null,null,null,{"$f":"IF(B985=\"\",\"\",SUMIF(Ausgaben!B:B,B985,Ausgaben!A:A))","v":""}]
[null,{"$f":"IF(Konfiguration!B977=\"\",\"\",Konfiguration!B977)","v":""},null,null,null,{"$f":"IF(Konfiguration!B977=\"\",\"\",Konfiguration!C977)","v":""},{"$f":"IF(Konfiguration!B977=\"\",\"\",Konfiguration!D977)","v":""},null,null,null,{"$f":"IF(B986=\"\",\"\",SUMIF(Ausgaben!B:B,B986,Ausgaben!A:A))","v":""}]
[null,{"$f":"IF(Konfiguration!B978=\"\",\"\",Konfiguration!B978)","v":""},null,null,null,{"$f":"IF(Konfiguration!B978=\"\",\"\",Konfiguration!C978)","v":""},{"$f":"IF(Konfiguration!B978=\"\",\"\",Konfiguration!D978)","v":""},null,null,null,{"$f":"IF(B987=\"\",\"\",SUMIF(Ausgaben!B:B,B987,Ausgaben!A:A))","v":""}]
[null,{"$f":"IF(Konfiguration!B979=\"\",\"\",Konfiguration!B979)","v":""},null,null,null,{"$f":"IF(Konfiguration!B979=\"\",\"\",Konfiguration!C979)","v":""},{"$f":"IF(Konfiguration!B979=\"\",\"\",Konfiguration!D979)","v":""},null,null,null,{"$f":"IF(B988=\"\",\"\",SUMIF(Ausgaben!B:B,B988,Ausgaben!A:A))","v":""}]
[null,{"$f":"IF(Konfiguration!B980=\"\",\"\",Konfiguration!B980)","v":""},null,null,null,{"$f":"IF(Konfiguration!B980=\"\",\"\",Konfiguration!C980)","v":""},{"$f":"IF(Konfiguration!B980=\"\",\"\",Konfiguration!D980)","v":""},null,null,null,{"$f":"IF(B989=\"\",\"\",SUMIF(Ausgaben!B:B,B989,Ausgaben!A:A))","v":""}]
[null,{"$f":"IF(Konfiguration!B981=\"\",\"\",Konfiguration!B981)","v":""},null,null,null,{"$f":"IF(Konfiguration!B981=\"\",\"\",Konfiguration!C981)","v":""},{"$f":"IF(Konfiguration!B981=\"\",\"\",Konfiguration!D981)","v":""},null,null,null,{"$f":"IF(B990=\"\",\"\",SUMIF(Ausgaben!B:B,B990,Ausgaben!A:A))","v":""}]
[null,{"$f":"IF(Konfiguration!B982=\"\",\"\",Konfiguration!B982)","v":""},null,null,null,{"$f":"IF(Konfiguration!B982=\"\",\"\",Konfiguration!C982)","v":""},{"$f":"IF(Konfiguration!B982=\"\",\"\",Konfiguration!D982)","v":""},null,null,null,{"$f":"IF(B991=\"\",\"\",SUMIF(Ausgaben!B:B,B991,Ausgaben!A:A))","v":""}]
[null,{"$f":"IF(Konfiguration!B983=\"\",\"\",Konfiguration!B983)","v":""},null,null,null,{"$f":"IF(Konfiguration!B983=\"\",\"\",Konfiguration!C983)","v":""},{"$f":"IF(Konfiguration!B983=\"\",\"\",Konfiguration!D983)","v":""},null,null,null,{"$f":"IF(B992=\"\",\"\",SUMIF(Ausgaben!B:B,B992,Ausgaben!A:A))","v":""}]
[null,{"$f":"IF(Konfiguration!B984=\"\",\"\",Konfiguration!B984)","v":""},null,null,null,{"$f":"IF(Konfiguration!B984=\"\",\"\",Konfiguration!C984)","v":""},{"$f":"IF(Konfiguration!B984=\"\",\"\",Konfiguration!D984)","v":""},null,null,null,{"$f":"IF(B993=\"\",\"\",SUMIF(Ausgaben!B:B,B993,Ausgaben!A:A))","v":""}]
[null,{"$f":"IF(Konfiguration!B985=\"\",\"\",Konfiguration!B985)","v":""},null,null,null,{"$f":"IF(Konfiguration!B985=\"\",\"\",Konfiguration!C985)","v":""},{"$f":"IF(Konfiguration!B985=\"\",\"\",Konfiguration!D985)","v":""},null,null,null,{"$f":"IF(B994=\"\",\"\",SUMIF(Ausgaben!B:B,B994,Ausgaben!A:A))","v":""}]
[null,{"$f":"IF(Konfiguration!B986=\"\",\"\",Konfiguration!B986)","v":""},null,null,null,{"$f":"IF(Konfiguration!B986=\"\",\"\",Konfiguration!C986)","v":""},{"$f":"IF(Konfiguration!B986=\"\",\"\",Konfiguration!D986)","v":""},null,null,null,{"$f":"IF(B995=\"\",\"\",SUMIF(Ausgaben!B:B,B995,Ausgaben!A:A))","v":""}]
[null,{"$f":"IF(Konfiguration!B987=\"\",\"\",Konfiguration!B987)","v":""},null,null,null,{"$f":"IF(Konfiguration!B987=\"\",\"\",Konfiguration!C987)","v":""},{"$f":"IF(Konfiguration!B987=\"\",\"\",Konfiguration!D987)","v":""},null,null,null,{"$f":"IF(B996=\"\",\"\",SUMIF(Ausgaben!B:B,B996,Ausgaben!A:A))","v":""}]
[null,{"$f":"IF(Konfiguration!B988=\"\",\"\",Konfiguration!B988)","v":""},null,null,null,{"$f":"IF(Konfiguration!B988=\"\",\"\",Konfiguration!C988)","v":""},{"$f":"IF(Konfiguration!B988=\"\",\"\",Konfiguration!D988)","v":""},null,null,null,{"$f":"IF(B997=\"\",\"\",SUMIF(Ausgaben!B:B,B997,Ausgaben!A:A))","v":""}]
[null,{"$f":"IF(Konfiguration!B989=\"\",\"\",Konfiguration!B989)","v":""},null,null,null,{"$f":"IF(Konfiguration!B989=\"\",\"\",Konfiguration!C989)","v":""},{"$f":"IF(Konfiguration!B989=\"\",\"\",Konfiguration!D989)","v":""},null,null,null,{"$f":"IF(B998=\"\",\"\",SUMIF(Ausgaben!B:B,B998,Ausgaben!A:A))","v":""}]
[null,{"$f":"IF(Konfiguration!B990=\"\",\"\",Konfiguration!B990)","v":""},null,null,null,{"$f":"IF(Konfiguration!B990=\"\",\"\",Konfiguration!C990)","v":""},{"$f":"IF(Konfiguration!B990=\"\",\"\",Konfiguration!D990)","v":""},null,null,null,{"$f":"IF(B999=\"\",\"\",SUMIF(Ausgaben!B:B,B999,Ausgaben!A:A))","v":""}]
[null,{"$f":"IF(Konfiguration!B991=\"\",\"\",Konfiguration!B991)","v":""},null,null,null,{"$f":"IF(Konfiguration!B991=\"\",\"\",Konfiguration!C991)","v":""},{"$f":"IF(Konfiguration!B991=\"\",\"\",Konfiguration!D991)","v":""},null,null,null,{"$f":"IF(B1000=\"\",\"\",SUMIF(Ausgaben!B:B,B1000,Ausgaben!A:A))","v":""}]
[null,{"$f":"IF(Konfiguration!B992=\"\",\"\",Konfiguration!B992)","v":""},null,null,null,{"$f":"IF(Konfiguration!B992=\"\",\"\",Konfiguration!C992)","v":""},{"$f":"IF(Konfiguration!B992=\"\",\"\",Konfiguration!D992)","v":""},null,null,null,{"$f":"IF(B1001=\"\",\"\",SUMIF(Ausgaben!B:B,B1001,Ausgaben!A:A))","v":""}]
[null,{"$f":"IF(Konfiguration!B993=\"\",\"\",Konfiguration!B993)","v":""},null,null,null,{"$f":"IF(Konfiguration!B993=\"\",\"\",Konfiguration!C993)","v":""},{"$f":"IF(Konfiguration!B993=\"\",\"\",Konfiguration!D993)","v":""},null,null,null,{"$f":"IF(B1002=\"\",\"\",SUMIF(Ausgaben!B:B,B1002,Ausgaben!A:A))","v":""}]
[null,{"$f":"IF(Konfiguration!B994=\"\",\"\",Konfiguration!B994)","v":""},null,null,null,{"$f":"IF(Konfiguration!B994=\"\",\"\",Konfiguration!C994)","v":""},{"$f":"IF(Konfiguration!B994=\"\",\"\",Konfiguration!D994)","v":""},null,null,null,{"$f":"IF(B1003=\"\",\"\",SUMIF(Ausgaben!B:B,B1003,Ausgaben!A:A))","v":""}]
[null,{"$f":"IF(Konfiguration!B995=\"\",\"\",Konfiguration!B995)","v":""},null,null,null,{"$f":"IF(Konfiguration!B995=\"\",\"\",Konfiguration!C995)","v":""},{"$f":"IF(Konfiguration!B995=\"\",\"\",Konfiguration!D995)","v":""},null,null,null,{"$f":"IF(B1004=\"\",\"\",SUMIF(Ausgaben!B:B,B1004,Ausgaben!A:A))","v":""}]
[null,{"$f":"IF(Konfiguration!B996=\"\",\"\",Konfiguration!B996)","v":""},null,null,null,{"$f":"IF(Konfiguration!B996=\"\",\"\",Konfiguration!C996)","v":""},{"$f":"IF(Konfiguration!B996=\"\",\"\",Konfiguration!D996)","v":""},null,null,null,{"$f":"IF(B1005=\"\",\"\",SUMIF(Ausgaben!B:B,B1005,Ausgaben!A:A))","v":""}]
[null,{"$f":"IF(Konfiguration!B997=\"\",\"\",Konfiguration!B997)","v":""},null,null,null,{"$f":"IF(Konfiguration!B997=\"\",\"\",Konfiguration!C997)","v":""},{"$f":"IF(Konfiguration!B997=\"\",\"\",Konfiguration!D997)","v":""},null,null,null,{"$f":"IF(B1006=\"\",\"\",SUMIF(Ausgaben!B:B,B1006,Ausgaben!A:A))","v":""}]
[null,{"$f":"IF(Konfiguration!B998=\"\",\"\",Konfiguration!B998)","v":""},null,null,null,{"$f":"IF(Konfiguration!B998=\"\",\"\",Konfiguration!C998)","v":""},{"$f":"IF(Konfiguration!B998=\"\",\"\",Konfiguration!D998)","v":""},null,null,null,{"$f":"IF(B1007=\"\",\"\",SUMIF(Ausgaben!B:B,B1007,Ausgaben!A:A))","v":""}]
[null,{"$f":"IF(Konfiguration!B999=\"\",\"\",Konfiguration!B999)","v":""},null,null,null,{"$f":"IF(Konfiguration!B999=\"\",\"\",Konfiguration!C999)","v":""},{"$f":"IF(Konfiguration!B999=\"\",\"\",Konfiguration!D999)","v":""},null,null,null,{"$f":"IF(B1008=\"\",\"\",SUMIF(Ausgaben!B:B,B1008,Ausgaben!A:A))","v":""}]
[null,{"$f":"IF(Konfiguration!B1000=\"\",\"\",Konfiguration!B1000)","v":""},null,null,null,{"$f":"IF(Konfiguration!B1000=\"\",\"\",Konfiguration!C1000)","v":""},{"$f":"IF(Konfiguration!B1000=\"\",\"\",Konfiguration!D1000)","v":""},null,null,null,{"$f":"IF(B1009=\"\",\"\",SUMIF(Ausgaben!B:B,B1009,Ausgaben!A:A))","v":""}]
[null,{"$f":"IF(Konfiguration!B1001=\"\",\"\",Konfiguration!B1001)","v":""},null,null,null,{"$f":"IF(Konfiguration!B1001=\"\",\"\",Konfiguration!C1001)","v":""},{"$f":"IF(Konfiguration!B1001=\"\",\"\",Konfiguration!D1001)","v":""},null,null,null,{"$f":"IF(B1010=\"\",\"\",SUMIF(Ausgaben!B:B,B1010,Ausgaben!A:A))","v":""}]
[null,{"$f":"IF(Konfiguration!B1002=\"\",\"\",Konfiguration!B1002)","v":""},null,null,null,{"$f":"IF(Konfiguration!B1002=\"\",\"\",Konfiguration!C1002)","v":""},{"$f":"IF(Konfiguration!B1002=\"\",\"\",Konfiguration!D1002)","v":""},null,null,null,{"$f":"IF(B1011=\"\",\"\",SUMIF(Ausgaben!B:B,B1011,Ausgaben!A:A))","v":""}]
[null,{"$f":"IF(Konfiguration!B1003=\"\",\"\",Konfiguration!B1003)","v":""},null,null,null,{"$f":"IF(Konfiguration!B1003=\"\",\"\",Konfiguration!C1003)","v":""},{"$f":"IF(Konfiguration!B1003=\"\",\"\",Konfiguration!D1003)","v":""},null,null,null,{"$f":"IF(B1012=\"\",\"\",SUMIF(Ausgaben!B:B,B1012,Ausgaben!A:A))","v":""}]
[null,{"$f":"IF(Konfiguration!B1004=\"\",\"\",Konfiguration!B1004)","v":""},null,null,null,{"$f":"IF(Konfiguration!B1004=\"\",\"\",Konfiguration!C1004)","v":""},{"$f":"IF(Konfiguration!B1004=\"\",\"\",Konfiguration!D1004)","v":""},null,null,null,{"$f":"IF(B1013=\"\",\"\",SUMIF(Ausgaben!B:B,B1013,Ausgaben!A:A))","v":""}]
[null,{"$f":"IF(Konfiguration!B1005=\"\",\"\",Konfiguration!B1005)","v":""},null,null,null,{"$f":"IF(Konfiguration!B1005=\"\",\"\",Konfiguration!C1005)","v":""},{"$f":"IF(Konfiguration!B1005=\"\",\"\",Konfiguration!D1005)","v":""},null,null,null,{"$f":"IF(B1014=\"\",\"\",SUMIF(Ausgaben!B:B,B1014,Ausgaben!A:A))","v":""}]
[null,{"$f":"IF(Konfiguration!B1006=\"\",\"\",Konfiguration!B1006)","v":""},null,null,null,{"$f":"IF(Konfiguration!B1006=\"\",\"\",Konfiguration!C1006)","v":""},{"$f":"IF(Konfiguration!B1006=\"\",\"\",Konfiguration!D1006)","v":""},null,null,null,{"$f":"IF(B1015=\"\",\"\",SUMIF(Ausgaben!B:B,B1015,Ausgaben!A:A))","v":""}]
[null,{"$f":"IF(Konfiguration!B1007=\"\",\"\",Konfiguration!B1007)","v":""},null,null,null,{"$f":"IF(Konfiguration!B1007=\"\",\"\",Konfiguration!C1007)","v":""},{"$f":"IF(Konfiguration!B1007=\"\",\"\",Konfiguration!D1007)","v":""},null,null,null,{"$f":"IF(B1016=\"\",\"\",SUMIF(Ausgaben!B:B,B1016,Ausgaben!A:A))","v":""}]
[null,{"$f":"IF(Konfiguration!B1008=\"\",\"\",Konfiguration!B1008)","v":""},null,null,null,{"$f":"IF(Konfiguration!B1008=\"\",\"\",Konfiguration!C1008)","v":""},{"$f":"IF(Konfiguration!B1008=\"\",\"\",Konfiguration!D1008)","v":""},null,null,null,{"$f":"IF(B1017=\"\",\"\",SUMIF(Ausgaben!B:B,B1017,Ausgaben!A:A))","v":""}]
[null,{"$f":"IF(Konfiguration!B1009=\"\",\"\",Konfiguration!B1009)","v":""},null,null,null,{"$f":"IF(Konfiguration!B1009=\"\",\"\",Konfiguration!C1009)","v":""},{"$f":"IF(Konfiguration!B1009=\"\",\"\",Konfiguration!D1009)","v":""},null,null,null,{"$f":"IF(B1018=\"\",\"\",SUMIF(Ausgaben!B:B,B1018,Ausgaben!A:A))","v":""}]
[null,{"$f":"IF(Konfiguration!B1010=\"\",\"\",Konfiguration!B1010)","v":""},null,null,null,{"$f":"IF(Konfiguration!B1010=\"\",\"\",Konfiguration!C1010)","v":""},{"$f":"IF(Konfiguration!B1010=\"\",\"\",Konfiguration!D1010)","v":""},null,null,null,{"$f":"IF(B1019=\"\",\"\",SUMIF(Ausgaben!B:B,B1019,Ausgaben!A:A))","v":""}]
[null,{"$f":"IF(Konfiguration!B1011=\"\",\"\",Konfiguration!B1011)","v":""},null,null,null,{"$f":"IF(Konfiguration!B1011=\"\",\"\",Konfiguration!C1011)","v":""},{"$f":"IF(Konfiguration!B1011=\"\",\"\",Konfiguration!D1011)","v":""},null,null,null,{"$f":"IF(B1020=\"\",\"\",SUMIF(Ausgaben!B:B,B1020,Ausgaben!A:A))","v":""}]
[null,{"$f":"IF(Konfiguration!B1012=\"\",\"\",Konfiguration!B1012)","v":""},null,null,null,{"$f":"IF(Konfiguration!B1012=\"\",\"\",Konfiguration!C1012)","v":""},{"$f":"IF(Konfiguration!B1012=\"\",\"\",Konfiguration!D1012)","v":""},null,null,null,{"$f":"IF(B1021=\"\",\"\",SUMIF(Ausgaben!B:B,B1021,Ausgaben!A:A))","v":""}]
[null,{"$f":"IF(Konfiguration!B1013=\"\",\"\",Konfiguration!B1013)","v":""},null,null,null,{"$f":"IF(Konfiguration!B1013=\"\",\"\",Konfiguration!C1013)","v":""},{"$f":"IF(Konfiguration!B1013=\"\",\"\",Konfiguration!D1013)","v":""},null,null,null,{"$f":"IF(B1022=\"\",\"\",SUMIF(Ausgaben!B:B,B1022,Ausgaben!A:A))","v":""}]
[null,{"$f":"IF(Konfiguration!B1014=\"\",\"\",Konfiguration!B1014)","v":""},null,null,null,{"$f":"IF(Konfiguration!B1014=\"\",\"\",Konfiguration!C1014)","v":""},{"$f":"IF(Konfiguration!B1014=\"\",\"\",Konfiguration!D1014)","v":""},null,null,null,{"$f":"IF(B1023=\"\",\"\",SUMIF(Ausgaben!B:B,B1023,Ausgaben!A:A))","v":""}]
[null,{"$f":"IF(Konfiguration!B1015=\"\",\"\",Konfiguration!B1015)","v":""},null,null,null,{"$f":"IF(Konfiguration!B1015=\"\",\"\",Konfiguration!C1015)","v":""},{"$f":"IF(Konfiguration!B1015=\"\",\"\",Konfiguration!D1015)","v":""},null,null,null,{"$f":"IF(B1024=\"\",\"\",SUMIF(Ausgaben!B:B,B1024,Ausgaben!A:A))","v":""}]
[null,{"$f":"IF(Konfiguration!B1016=\"\",\"\",Konfiguration!B1016)","v":""},null,null,null,{"$f":"IF(Konfiguration!B1016=\"\",\"\",Konfiguration!C1016)","v":""},{"$f":"IF(Konfiguration!B1016=\"\",\"\",Konfiguration!D1016)","v":""},null,null,null,{"$f":"IF(B1025=\"\",\"\",SUMIF(Ausgaben!B:B,B1025,Ausgaben!A:A))","v":""}]
[null,{"$f":"IF(Konfiguration!B1017=\"\",\"\",Konfiguration!B1017)","v":""},null,null,null,{"$f":"IF(Konfiguration!B1017=\"\",\"\",Konfiguration!C1017)","v":""},{"$f":"IF(Konfiguration!B1017=\"\",\"\",Konfiguration!D1017)","v":""},null,null,null,{"$f":"IF(B1026=\"\",\"\",SUMIF(Ausgaben!B:B,B1026,Ausgaben!A:A))","v":""}]
[null,{"$f":"IF(Konfiguration!B1018=\"\",\"\",Konfiguration!B1018)","v":""},null,null,null,{"$f":"IF(Konfiguration!B1018=\"\",\"\",Konfiguration!C1018)","v":""},{"$f":"IF(Konfiguration!B1018=\"\",\"\",Konfiguration!D1018)","v":""},null,null,null,{"$f":"IF(B1027=\"\",\"\",SUMIF(Ausgaben!B:B,B1027,Ausgaben!A:A))","v":""}]
[null,{"$f":"IF(Konfiguration!B1019=\"\",\"\",Konfiguration!B1019)","v":""},null,null,null,{"$f":"IF(Konfiguration!B1019=\"\",\"\",Konfiguration!C1019)","v":""},{"$f":"IF(Konfiguration!B1019=\"\",\"\",Konfiguration!D1019)","v":""},null,null,null,{"$f":"IF(B1028=\"\",\"\",SUMIF(Ausgaben!B:B,B1028,Ausgaben!A:A))","v":""}]
[null,{"$f":"IF(Konfiguration!B1020=\"\",\"\",Konfiguration!B1020)","v":""},null,null,null,{"$f":"IF(Konfiguration!B1020=\"\",\"\",Konfiguration!C1020)","v":""},{"$f":"IF(Konfiguration!B1020=\"\",\"\",Konfiguration!D1020)","v":""},null,null,null,{"$f":"IF(B1029=\"\",\"\",SUMIF(Ausgaben!B:B,B1029,Ausgaben!A:A))","v":""}]
[null,{"$f":"IF(Konfiguration!B1021=\"\",\"\",Konfiguration!B1021)","v":""},null,null,null,{"$f":"IF(Konfiguration!B1021=\"\",\"\",Konfiguration!C1021)","v":""},{"$f":"IF(Konfiguration!B1021=\"\",\"\",Konfiguration!D1021)","v":""},null,null,null,{"$f":"IF(B1030=\"\",\"\",SUMIF(Ausgaben!B:B,B1030,Ausgaben!A:A))","v":""}]
[null,{"$f":"IF(Konfiguration!B1022=\"\",\"\",Konfiguration!B1022)","v":""},null,null,null,{"$f":"IF(Konfiguration!B1022=\"\",\"\",Konfiguration!C1022)","v":""},{"$f":"IF(Konfiguration!B1022=\"\",\"\",Konfiguration!D1022)","v":""},null,null,null,{"$f":"IF(B1031=\"\",\"\",SUMIF(Ausgaben!B:B,B1031,Ausgaben!A:A))","v":""}]
[null,{"$f":"IF(Konfiguration!B1023=\"\",\"\",Konfiguration!B1023)","v":""},null,null,null,{"$f":"IF(Konfiguration!B1023=\"\",\"\",Konfiguration!C1023)","v":""},{"$f":"IF(Konfiguration!B1023=\"\",\"\",Konfiguration!D1023)","v":""},null,null,null,{"$f":"IF(B1032=\"\",\"\",SUMIF(Ausgaben!B:B,B1032,Ausgaben!A:A))","v":""}]
[null,{"$f":"IF(Konfiguration!B1024=\"\",\"\",Konfiguration!B1024)","v":""},null,null,null,{"$f":"IF(Konfiguration!B1024=\"\",\"\",Konfiguration!C1024)","v":""},{"$f":"IF(Konfiguration!B1024=\"\",\"\",Konfiguration!D1024)","v":""},null,null,null,{"$f":"IF(B1033=\"\",\"\",SUMIF(Ausgaben!B:B,B1033,Ausgaben!A:A))","v":""}]
[null,{"$f":"IF(Konfiguration!B1025=\"\",\"\",Konfiguration!B1025)","v":""},null,null,null,{"$f":"IF(Konfiguration!B1025=\"\",\"\",Konfiguration!C1025)","v":""},{"$f":"IF(Konfiguration!B1025=\"\",\"\",Konfiguration!D1025)","v":""},null,null,null,{"$f":"IF(B1034=\"\",\"\",SUMIF(Ausgaben!B:B,B1034,Ausgaben!A:A))","v":""}]
[null,{"$f":"IF(Konfiguration!B1026=\"\",\"\",Konfiguration!B1026)","v":""},null,null,null,{"$f":"IF(Konfiguration!B1026=\"\",\"\",Konfiguration!C1026)","v":""},{"$f":"IF(Konfiguration!B1026=\"\",\"\",Konfiguration!D1026)","v":""},null,null,null,{"$f":"IF(B1035=\"\",\"\",SUMIF(Ausgaben!B:B,B1035,Ausgaben!A:A))","v":""}]
[null,{"$f":"IF(Konfiguration!B1027=\"\",\"\",Konfiguration!B1027)","v":""},null,null,null,{"$f":"IF(Konfiguration!B1027=\"\",\"\",Konfiguration!C1027)","v":""},{"$f":"IF(Konfiguration!B1027=\"\",\"\",Konfiguration!D1027)","v":""},null,null,null,{"$f":"IF(B1036=\"\",\"\",SUMIF(Ausgaben!B:B,B1036,Ausgaben!A:A))","v":""}]
[null,{"$f":"IF(Konfiguration!B1028=\"\",\"\",Konfiguration!B1028)","v":""},null,null,null,{"$f":"IF(Konfiguration!B1028=\"\",\"\",Konfiguration!C1028)","v":""},{"$f":"IF(Konfiguration!B1028=\"\",\"\",Konfiguration!D1028)","v":""},null,null,null,{"$f":"IF(B1037=\"\",\"\",SUMIF(Ausgaben!B:B,B1037,Ausgaben!A:A))","v":""}]
[null,{"$f":"IF(Konfiguration!B1029=\"\",\"\",Konfiguration!B1029)","v":""},null,null,null,{"$f":"IF(Konfiguration!B1029=\"\",\"\",Konfiguration!C1029)","v":""},{"$f":"IF(Konfiguration!B1029=\"\",\"\",Konfiguration!D1029)","v":""},null,null,null,{"$f":"IF(B1038=\"\",\"\",SUMIF(Ausgaben!B:B,B1038,Ausgaben!A:A))","v":""}]
[null,{"$f":"IF(Konfiguration!B1030=\"\",\"\",Konfiguration!B1030)","v":""},null,null,null,{"$f":"IF(Konfiguration!B1030=\"\",\"\",Konfiguration!C1030)","v":""},{"$f":"IF(Konfiguration!B1030=\"\",\"\",Konfiguration!D1030)","v":""},null,null,null,{"$f":"IF(B1039=\"\",\"\",SUMIF(Ausgaben!B:B,B1039,Ausgaben!A:A))","v":""}]
[null,{"$f":"IF(Konfiguration!B1031=\"\",\"\",Konfiguration!B1031)","v":""},null,null,null,{"$f":"IF(Konfiguration!B1031=\"\",\"\",Konfiguration!C1031)","v":""},{"$f":"IF(Konfiguration!B1031=\"\",\"\",Konfiguration!D1031)","v":""},null,null,null,{"$f":"IF(B1040=\"\",\"\",SUMIF(Ausgaben!B:B,B1040,Ausgaben!A:A))","v":""}]
[null,{"$f":"IF(Konfiguration!B1032=\"\",\"\",Konfiguration!B1032)","v":""},null,null,null,{"$f":"IF(Konfiguration!B1032=\"\",\"\",Konfiguration!C1032)","v":""},{"$f":"IF(Konfiguration!B1032=\"\",\"\",Konfiguration!D1032)","v":""},null,null,null,{"$f":"IF(B1041=\"\",\"\",SUMIF(Ausgaben!B:B,B1041,Ausgaben!A:A))","v":""}]
[null,{"$f":"IF(Konfiguration!B1033=\"\",\"\",Konfiguration!B1033)","v":""},null,null,null,{"$f":"IF(Konfiguration!B1033=\"\",\"\",Konfiguration!C1033)","v":""},{"$f":"IF(Konfiguration!B1033=\"\",\"\",Konfiguration!D1033)","v":""},null,null,null,{"$f":"IF(B1042=\"\",\"\",SUMIF(Ausgaben!B:B,B1042,Ausgaben!A:A))","v":""}]
[null,{"$f":"IF(Konfiguration!B1034=\"\",\"\",Konfiguration!B1034)","v":""},null,null,null,{"$f":"IF(Konfiguration!B1034=\"\",\"\",Konfiguration!C1034)","v":""},{"$f":"IF(Konfiguration!B1034=\"\",\"\",Konfiguration!D1034)","v":""},null,null,null,{"$f":"IF(B1043=\"\",\"\",SUMIF(Ausgaben!B:B,B1043,Ausgaben!A:A))","v":""}]
[null,{"$f":"IF(Konfiguration!B1035=\"\",\"\",Konfiguration!B1035)","v":""},null,null,null,{"$f":"IF(Konfiguration!B1035=\"\",\"\",Konfiguration!C1035)","v":""},{"$f":"IF(Konfiguration!B1035=\"\",\"\",Konfiguration!D1035)","v":""},null,null,null,{"$f":"IF(B1044=\"\",\"\",SUMIF(Ausgaben!B:B,B1044,Ausgaben!A:A))","v":""}]
[null,{"$f":"IF(Konfiguration!B1036=\"\",\"\",Konfiguration!B1036)","v":""},null,null,null,{"$f":"IF(Konfiguration!B1036=\"\",\"\",Konfiguration!C1036)","v":""},{"$f":"IF(Konfiguration!B1036=\"\",\"\",Konfiguration!D1036)","v":""},null,null,null,{"$f":"IF(B1045=\"\",\"\",SUMIF(Ausgaben!B:B,B1045,Ausgaben!A:A))","v":""}]
[null,{"$f":"IF(Konfiguration!B1037=\"\",\"\",Konfiguration!B1037)","v":""},null,null,null,{"$f":"IF(Konfiguration!B1037=\"\",\"\",Konfiguration!C1037)","v":""},{"$f":"IF(Konfiguration!B1037=\"\",\"\",Konfiguration!D1037)","v":""},null,null,null,{"$f":"IF(B1046=\"\",\"\",SUMIF(Ausgaben!B:B,B1046,Ausgaben!A:A))","v":""}]
[null,{"$f":"IF(Konfiguration!B1038=\"\",\"\",Konfiguration!B1038)","v":""},null,null,null,{"$f":"IF(Konfiguration!B1038=\"\",\"\",Konfiguration!C1038)","v":""},{"$f":"IF(Konfiguration!B1038=\"\",\"\",Konfiguration!D1038)","v":""},null,null,null,{"$f":"IF(B1047=\"\",\"\",SUMIF(Ausgaben!B:B,B1047,Ausgaben!A:A))","v":""}]
[null,{"$f":"IF(Konfiguration!B1039=\"\",\"\",Konfiguration!B1039)","v":""},null,null,null,{"$f":"IF(Konfiguration!B1039=\"\",\"\",Konfiguration!C1039)","v":""},{"$f":"IF(Konfiguration!B1039=\"\",\"\",Konfiguration!D1039)","v":""},null,null,null,{"$f":"IF(B1048=\"\",\"\",SUMIF(Ausgaben!B:B,B1048,Ausgaben!A:A))","v":""}]
[null,{"$f":"IF(Konfiguration!B1040=\"\",\"\",Konfiguration!B1040)","v":""},null,null,null,{"$f":"IF(Konfiguration!B1040=\"\",\"\",Konfiguration!C1040)","v":""},{"$f":"IF(Konfiguration!B1040=\"\",\"\",Konfiguration!D1040)","v":""},null,null,null,{"$f":"IF(B1049=\"\",\"\",SUMIF(Ausgaben!B:B,B1049,Ausgaben!A:A))","v":""}]
[null,{"$f":"IF(Konfiguration!B1041=\"\",\"\",Konfiguration!B1041)","v":""},null,null,null,{"$f":"IF(Konfiguration!B1041=\"\",\"\",Konfiguration!C1041)","v":""},{"$f":"IF(Konfiguration!B1041=\"\",\"\",Konfiguration!D1041)","v":""},null,null,null,{"$f":"IF(B1050=\"\",\"\",SUMIF(Ausgaben!B:B,B1050,Ausgaben!A:A))","v":""}]